program: Orca
programVersion: 5.0.2
elementType: Si F O O C C C C C C C C C C C C C C C C C C C C C C C C C H H H H H H H H H H H H H H H H H H H H H H H H H H H H H
charge: 0
multiplicity: 1
keywords: wb97x-d3
keywords: def2-TZVPP
keywords: def2/J RIJCOSX
keywords: DEFGRID2
keywords: scfconv7
keywords: smallprint printgap noloewdin
keywords: NOSOSCF
formula: C25H29FO2Si
InChI: InChI=1/C25H29FO2Si/c1-4-27-21-13-15-23(16-14-21)29(2,3)18-8-9-20-12-17-24(26)25(19-20)28-22-10-6-5-7-11-22/h5-7,10-17,19H,4,8-9,18H2,1-3H3
58 atoms
Si -3.052103 0.135963 0.408169
F  3.726286 -0.409138 -0.392399
O  1.362586 2.67001 3.684059
O  2.315934 -2.081138 -1.928206
C  -2.370489 0.149564 -1.349919
C  -1.995176 1.542175 -1.863218
C  -1.730473 0.923468 1.4955
C  -3.333621 -1.649097 0.938605
C  -4.641183 1.13218 0.530495
C  -0.88848 1.533789 -2.928882
C  -1.971086 2.051175 2.276601
C  -0.42155 0.424041 1.49914
C  0.407753 1.046327 -2.34659
C  -0.973359 2.665345 3.02806
C  0.587496 1.015868 2.234357
C  0.318771 2.148995 3.005653
C  0.792927 -0.282335 -2.492853
C  1.191223 1.885722 -1.557031
C  1.901557 -0.782725 -1.824439
C  2.322298 1.40736 -0.914147
C  2.654858 0.07441 -1.037703
C  1.157756 3.839933 4.468943
C  2.481803 4.232806 5.07471
C  1.37612 -3.085616 -1.931588
C  1.632926 -4.181209 -2.742382
C  0.240357 -3.044913 -1.131825
C  0.740251 -5.244186 -2.75458
C  -0.65062 -4.107712 -1.166331
C  -0.408376 -5.209736 -1.975892
H  -1.492131 -0.505504 -1.331565
H  -3.07284 -0.331223 -2.037954
H  -1.660298 2.185151 -1.042429
H  -2.881585 2.028943 -2.276595
H  -3.739331 -1.71214 1.95025
H  -4.034524 -2.156793 0.27231
H  -2.400974 -2.218359 0.924927
H  -5.043318 1.146027 1.545243
H  -4.497734 2.168488 0.218611
H  -5.410096 0.703461 -0.115895
H  -1.187742 0.898706 -3.766143
H  -0.763116 2.545264 -3.321998
H  -2.963811 2.485215 2.311424
H  -0.167821 -0.44941 0.907518
H  -1.222892 3.539249 3.614443
H  1.592425 0.611595 2.210409
H  0.203349 -0.942261 -3.118056
H  0.912065 2.92441 -1.431022
H  2.929842 2.056764 -0.297083
H  0.420848 3.642868 5.254268
H  0.768451 4.650404 3.844354
H  2.877578 3.447589 5.719366
H  3.222098 4.459559 4.307178
H  2.348462 5.126887 5.683101
H  2.523259 -4.202962 -3.357868
H  0.042241 -2.19956 -0.485428
H  0.943045 -6.097824 -3.387902
H  -1.539032 -4.068544 -0.548716
H  -1.107397 -6.035013 -1.997872
elementType: Si F O C H
totalener: -1510.05282535 hartree
nucrepener: 2937.29203633 hartree
electener: -4447.34486168 hartree
oneelecener: -7904.92954675 hartree
twoeener: 3457.58468507 hartree
cpcmener: -0.02901012 hartree
kineticenergy: 1503.91200973 hartree
xcener: -135.233167064987 hartree
chargesum: 0.0000000
charge: 0.469740 -0.222316 -0.340484 -0.344750 -0.201562 -0.154853 -0.302352 -0.421503 -0.453680 -0.079682 -0.074678 -0.022071 0.060688 -0.284333 -0.365262 0.402791 -0.235334 -0.225935 0.226567 -0.196921 0.204836 0.066234 -0.275213 0.174513 -0.190367 -0.077645 -0.163404 -0.223708 -0.145687 0.021047 0.096149 0.078434 0.090985 0.108615 0.105415 0.093594 0.105412 0.106133 0.109200 0.083815 0.094891 0.145727 0.179258 0.139353 0.130792 0.153122 0.143965 0.149871 0.095837 0.093885 0.087194 0.086987 0.090345 0.147891 0.176702 0.160902 0.159507 0.161343
qa: 0.4697 -0.2223 -0.3405 -0.3448 -0.2016 -0.1549 -0.3024 -0.4215 -0.4537 -0.0797 -0.0747 -0.0221 0.0607 -0.2843 -0.3653 0.4028 -0.2353 -0.2259 0.2266 -0.1969 0.2048 0.0662 -0.2752 0.1745 -0.1904 -0.0776 -0.1634 -0.2237 -0.1457 0.0210 0.0961 0.0784 0.0910 0.1086 0.1054 0.0936 0.1054 0.1061 0.1092 0.0838 0.0949 0.1457 0.1793 0.1394 0.1308 0.1531 0.1440 0.1499 0.0958 0.0939 0.0872 0.0870 0.0903 0.1479 0.1767 0.1609 0.1595 0.1613
va: 4.1375 1.0600 2.0644 2.0726 3.8167 3.9129 3.8042 3.8957 3.9313 3.8488 3.8085 3.6467 3.5991 3.9220 4.0413 3.6955 3.8905 3.8388 3.6630 3.8427 4.0232 3.7924 3.9733 3.8184 3.9411 3.7733 3.9174 3.9415 3.8858 1.0357 1.0177 1.0028 1.0084 1.0108 1.0079 1.0100 1.0091 1.0063 1.0098 1.0097 1.0063 0.9872 0.9137 1.0127 1.0189 0.9999 1.0023 0.9983 0.9862 0.9866 1.0033 1.0033 1.0057 1.0059 0.9430 0.9880 0.9963 0.9900
dispcorr: -0.033181209 hartree
energy: -1510.086006558634
dipole: -26.14048 24.36629 -1.77419 13.16404 -12.06111 1.10293 9.92776 -9.93303 -0.00527
magnitude: 2.08908 au
magnitude: 5.31001 debye
