program: Orca
programVersion: 5.0.2
elementType: Si F O O C C C C C C C C C C C C C C C C C C C C C C C C C H H H H H H H H H H H H H H H H H H H H H H H H H H H H H
charge: 0
multiplicity: 1
keywords: wb97x-d3
keywords: def2-TZVPP
keywords: def2/J RIJCOSX
keywords: DEFGRID2
keywords: scfconv7
keywords: smallprint printgap noloewdin
keywords: NOSOSCF
formula: C25H29FO2Si
InChI: InChI=1/C25H29FO2Si/c1-4-27-21-13-15-23(16-14-21)29(2,3)18-8-9-20-12-17-24(26)25(19-20)28-22-10-6-5-7-11-22/h5-7,10-17,19H,4,8-9,18H2,1-3H3
58 atoms
Si -2.834316 1.38686 0.316153
F  1.05872 -4.990886 0.7768
O  2.40681 3.828751 2.106346
O  1.708042 -3.129834 -1.021872
C  -2.351703 -0.135833 -0.687195
C  -3.49611 -1.083281 -1.036191
C  -1.23472 2.210952 0.870372
C  -3.812396 0.849145 1.832235
C  -3.845723 2.581778 -0.722654
C  -3.065537 -2.27947 -1.899949
C  -0.780526 3.413285 0.334064
C  -0.416597 1.601464 1.831296
C  -1.97346 -3.076288 -1.247335
C  0.425987 3.993106 0.716045
C  0.785055 2.156632 2.228942
C  1.219327 3.361006 1.669087
C  -0.640561 -2.772269 -1.50762
C  -2.262667 -4.061282 -0.30665
C  0.384662 -3.396221 -0.812938
C  -1.244823 -4.720948 0.367108
C  0.066004 -4.373897 0.117917
C  2.941948 5.010291 1.520058
C  4.300203 5.256984 2.126388
C  2.114999 -1.835587 -1.248356
C  3.180055 -1.664581 -2.120914
C  1.537152 -0.744238 -0.610595
C  3.667757 -0.387444 -2.360599
C  2.021402 0.528686 -0.878097
C  3.085835 0.714746 -1.749758
H  -1.838605 0.193726 -1.599297
H  -1.594592 -0.670145 -0.102907
H  -4.283517 -0.546436 -1.573936
H  -3.958376 -1.458858 -0.118096
H  -4.043217 1.695287 2.482646
H  -4.761941 0.387447 1.550962
H  -3.262344 0.117329 2.428639
H  -4.129843 3.473031 -0.159426
H  -3.304803 2.910982 -1.61262
H  -4.769118 2.107978 -1.064447
H  -3.934099 -2.915177 -2.086779
H  -2.723435 -1.911791 -2.870691
H  -1.373609 3.934057 -0.409252
H  -0.715717 0.661898 2.283993
H  0.723296 4.929182 0.262858
H  1.400731 1.661111 2.969903
H  -0.403361 -2.017023 -2.247485
H  -3.29256 -4.318167 -0.092309
H  -1.46581 -5.490953 1.094958
H  2.2781 5.86005 1.708417
H  3.025087 4.88811 0.435067
H  4.72679 6.163247 1.696785
H  4.240324 5.397334 3.205943
H  4.986712 4.435691 1.919588
H  3.625017 -2.523673 -2.606431
H  0.718107 -0.869895 0.086042
H  4.500928 -0.25731 -3.038605
H  1.562455 1.379951 -0.391404
H  3.459761 1.710226 -1.948073
elementType: Si F O C H
totalener: -1510.05397328 hartree
nucrepener: 2888.65116314 hartree
electener: -4398.70513642 hartree
oneelecener: -7807.47164667 hartree
twoeener: 3408.76651025 hartree
cpcmener: -0.02747978 hartree
kineticenergy: 1503.90627543 hartree
xcener: -135.231286561182 hartree
chargesum: -0.0000000
charge: 0.515582 -0.221060 -0.338446 -0.343352 -0.219194 -0.157876 -0.162440 -0.439751 -0.450817 -0.092780 -0.145514 -0.149047 0.057867 -0.228833 -0.290719 0.340466 -0.262594 -0.222121 0.248391 -0.163029 0.169638 0.066320 -0.274522 0.323252 -0.271291 -0.249817 -0.094066 -0.039590 -0.260329 0.089562 0.060014 0.082466 0.083115 0.109738 0.106281 0.107192 0.109895 0.103635 0.106719 0.091840 0.086755 0.143339 0.139195 0.139230 0.133589 0.151042 0.145547 0.150243 0.095242 0.094246 0.090278 0.087413 0.086935 0.146629 0.180315 0.160884 0.117443 0.156893
qa: 0.5156 -0.2211 -0.3384 -0.3434 -0.2192 -0.1579 -0.1624 -0.4398 -0.4508 -0.0928 -0.1455 -0.1490 0.0579 -0.2288 -0.2907 0.3405 -0.2626 -0.2221 0.2484 -0.1630 0.1696 0.0663 -0.2745 0.3233 -0.2713 -0.2498 -0.0941 -0.0396 -0.2603 0.0896 0.0600 0.0825 0.0831 0.1097 0.1063 0.1072 0.1099 0.1036 0.1067 0.0918 0.0868 0.1433 0.1392 0.1392 0.1336 0.1510 0.1455 0.1502 0.0952 0.0942 0.0903 0.0874 0.0869 0.1466 0.1803 0.1609 0.1174 0.1569
va: 4.1012 1.0630 2.0640 2.0753 3.8049 3.9229 3.7258 3.8869 3.9247 3.8515 3.8927 3.8423 3.6005 3.8702 3.9943 3.7183 3.9087 3.9110 3.6384 3.8711 4.0713 3.7922 3.9727 3.7072 4.0181 3.8992 3.8538 3.7581 4.0044 1.0143 1.0283 1.0108 1.0015 1.0087 1.0058 1.0068 1.0080 1.0082 1.0101 1.0079 1.0097 0.9902 0.9941 1.0126 1.0156 1.0007 1.0008 0.9972 0.9864 0.9867 1.0055 1.0033 1.0036 1.0078 0.9804 0.9871 1.0178 0.9938
dispcorr: -0.031372767 hartree
energy: -1510.085346047961
dipole: -14.39197 13.40559 -0.98638 31.80694 -30.09489 1.71205 -0.41782 -0.45039 -0.86822
magnitude: 2.15820 au
magnitude: 5.48572 debye
