program: Orca
programVersion: 5.0.2
elementType: Si F O O C C C C C C C C C C C C C C C C C C C C C C C C C H H H H H H H H H H H H H H H H H H H H H H H H H H H H H
charge: 0
multiplicity: 1
keywords: wb97x-d3
keywords: def2-TZVPP
keywords: def2/J RIJCOSX
keywords: DEFGRID2
keywords: scfconv7
keywords: smallprint printgap noloewdin
keywords: NOSOSCF
formula: C25H29FO2Si
InChI: InChI=1/C25H29FO2Si/c1-4-27-21-13-15-23(16-14-21)29(2,3)18-8-9-20-12-17-24(26)25(19-20)28-22-10-6-5-7-11-22/h5-7,10-17,19H,4,8-9,18H2,1-3H3
58 atoms
Si -3.444507 1.459288 -0.338973
F  2.717727 -1.59494 0.343509
O  1.642043 1.542889 2.930537
O  1.652597 -2.285078 -2.095277
C  -3.41827 -0.314507 -0.985198
C  -3.608416 -1.347192 0.133101
C  -1.903608 1.611383 0.732831
C  -4.980107 1.762707 0.70244
C  -3.346313 2.679925 -1.765864
C  -2.795674 -2.630974 -0.063541
C  -1.937092 1.472276 2.118494
C  -0.639501 1.748179 0.145106
C  -1.316367 -2.379711 0.042097
C  -0.781905 1.453697 2.894612
C  0.52245 1.737148 0.893496
C  0.460147 1.576699 2.27935
C  -0.4963 -2.418609 -1.081522
C  -0.744269 -2.049709 1.269974
C  0.861807 -2.157035 -0.984325
C  0.611346 -1.779976 1.380748
C  1.402613 -1.842222 0.253188
C  1.643012 1.294285 4.332338
C  3.075799 1.240486 4.798965
C  2.380703 -1.206351 -2.533056
C  2.035251 0.106109 -2.242835
C  3.484336 -1.490781 -3.326818
C  2.821769 1.137814 -2.738999
C  4.252956 -0.449067 -3.823276
C  3.932569 0.86946 -3.525969
H  -4.159971 -0.467356 -1.774344
H  -2.443843 -0.44588 -1.470475
H  -4.666782 -1.60512 0.211652
H  -3.339207 -0.932549 1.110812
H  -5.074217 1.041222 1.516401
H  -4.9797 2.75994 1.146583
H  -5.881477 1.678253 0.091662
H  -4.209551 2.580924 -2.427398
H  -3.319746 3.713025 -1.414485
H  -2.454435 2.516363 -2.374146
H  -3.093558 -3.360211 0.694106
H  -3.029003 -3.071577 -1.035517
H  -2.887313 1.36764 2.630096
H  -0.548684 1.860279 -0.9304
H  -0.873665 1.335613 3.965728
H  1.487046 1.836827 0.409614
H  -0.911595 -2.66808 -2.050827
H  -1.360951 -2.00589 2.159165
H  1.055615 -1.531637 2.336434
H  1.13626 0.347566 4.546522
H  1.100109 2.086732 4.857305
H  3.097087 1.049734 5.871552
H  3.628524 0.439759 4.30726
H  3.593125 2.183018 4.618586
H  1.161946 0.336859 -1.64623
H  3.739025 -2.519008 -3.550395
H  2.554407 2.160438 -2.506365
H  5.113043 -0.674103 -4.440122
H  4.540382 1.678602 -3.907694
elementType: Si F O C H
totalener: -1510.05362175 hartree
nucrepener: 2994.65977491 hartree
electener: -4504.71339665 hartree
oneelecener: -8020.24182240 hartree
twoeener: 3515.52842574 hartree
cpcmener: -0.02943104 hartree
kineticenergy: 1503.91094614 hartree
xcener: -135.232697613444 hartree
chargesum: 0.0000000
charge: 0.481728 -0.220688 -0.339906 -0.339935 -0.258963 -0.127400 -0.147145 -0.428641 -0.449019 -0.092241 -0.154169 -0.104994 0.079447 -0.242315 -0.313505 0.352371 -0.268755 -0.273527 0.228704 -0.135909 0.219466 0.057037 -0.274563 0.252025 -0.145541 -0.226777 -0.189319 -0.141454 -0.172162 0.094796 0.078193 0.094050 0.065491 0.100731 0.110165 0.109387 0.104646 0.104283 0.100208 0.098318 0.085591 0.147400 0.144711 0.137681 0.126444 0.137179 0.146101 0.149363 0.095188 0.102994 0.091169 0.087014 0.087746 0.149423 0.146505 0.158944 0.160667 0.161763
qa: 0.4817 -0.2207 -0.3399 -0.3399 -0.2590 -0.1274 -0.1471 -0.4286 -0.4490 -0.0922 -0.1542 -0.1050 0.0794 -0.2423 -0.3135 0.3524 -0.2688 -0.2735 0.2287 -0.1359 0.2195 0.0570 -0.2746 0.2520 -0.1455 -0.2268 -0.1893 -0.1415 -0.1722 0.0948 0.0782 0.0940 0.0655 0.1007 0.1102 0.1094 0.1046 0.1043 0.1002 0.0983 0.0856 0.1474 0.1447 0.1377 0.1264 0.1372 0.1461 0.1494 0.0952 0.1030 0.0912 0.0870 0.0877 0.1494 0.1465 0.1589 0.1607 0.1618
va: 4.1403 1.0602 2.0483 2.0628 3.8229 3.8958 3.7004 3.9059 3.9073 3.8408 3.8739 3.8116 3.5799 3.8704 3.9590 3.7088 3.9946 3.8915 3.6518 3.8080 3.9897 3.7863 3.9731 3.7259 3.8363 3.9725 3.9258 3.9042 3.8835 1.0110 1.0148 1.0086 1.0051 1.0088 1.0075 1.0083 1.0107 1.0095 1.0116 1.0041 1.0089 0.9867 0.9779 1.0125 1.0207 1.0164 1.0028 0.9955 0.9843 0.9884 1.0055 1.0034 1.0032 0.9936 1.0088 0.9931 0.9881 0.9887
dispcorr: -0.034392914 hartree
energy: -1510.088014661279
dipole: -22.29745 20.98352 -1.31394 12.73335 -12.58091 0.15244 9.45148 -8.34434 1.10714
magnitude: 1.72494 au
magnitude: 4.38445 debye
