program: Orca
programVersion: 5.0.2
elementType: Si F O O C C C C C C C C C C C C C C C C C C C C C C C C C H H H H H H H H H H H H H H H H H H H H H H H H H H H H H
charge: 0
multiplicity: 1
keywords: wb97x-d3
keywords: def2-TZVPP
keywords: def2/J RIJCOSX
keywords: DEFGRID2
keywords: scfconv7
keywords: smallprint printgap noloewdin
keywords: NOSOSCF
formula: C25H29FO2Si
InChI: InChI=1/C25H29FO2Si/c1-4-27-21-13-15-23(16-14-21)29(2,3)18-8-9-20-12-17-24(26)25(19-20)28-22-10-6-5-7-11-22/h5-7,10-17,19H,4,8-9,18H2,1-3H3
58 atoms
Si -2.657577 1.576735 -0.637443
F  2.8972 -1.095819 1.062135
O  1.288696 1.364291 3.958414
O  2.427526 -1.505442 -1.534583
C  -2.699457 -0.154266 -1.394295
C  -3.147539 -1.263477 -0.429476
C  -1.458367 1.563139 0.816156
C  -4.363998 2.054547 -0.002621
C  -2.040074 2.792855 -1.935306
C  -2.292836 -2.537139 -0.507569
C  -1.891308 1.302818 2.116521
C  -0.084906 1.774053 0.646417
C  -0.877256 -2.264592 -0.085204
C  -1.017708 1.231891 3.195283
C  0.805119 1.706694 1.703143
C  0.346198 1.422266 2.990232
C  0.124675 -2.077377 -1.031508
C  -0.562342 -2.104433 1.263473
C  1.400052 -1.682778 -0.649978
C  0.713577 -1.737696 1.658251
C  1.673914 -1.505975 0.696139
C  0.919777 0.99128 5.282514
C  0.670522 -0.494499 5.434634
C  2.210533 -0.842359 -2.717047
C  1.30611 0.205224 -2.839571
C  2.986752 -1.237167 -3.798286
C  1.179487 0.850585 -4.061742
C  2.856059 -0.575425 -5.010465
C  1.948993 0.466296 -5.151425
H  -3.32941 -0.152075 -2.288518
H  -1.685336 -0.344161 -1.762601
H  -4.186966 -1.527742 -0.633961
H  -3.135118 -0.923514 0.611667
H  -4.357115 3.030071 0.487047
H  -5.08612 2.102571 -0.820039
H  -4.745141 1.329374 0.719619
H  -1.063216 2.497588 -2.326321
H  -2.723984 2.839704 -2.785293
H  -1.942258 3.803738 -1.535702
H  -2.731988 -3.299319 0.140471
H  -2.3119 -2.932181 -1.525775
H  -2.945306 1.146488 2.316591
H  0.312861 1.999592 -0.336751
H  -1.421764 1.023698 4.176549
H  1.863654 1.867458 1.537517
H  -0.09792 -2.222537 -2.082144
H  -1.324411 -2.257471 2.017632
H  0.95915 -1.608656 2.70447
H  0.059373 1.574873 5.622024
H  1.766394 1.288231 5.900968
H  -0.176803 -0.844585 4.845026
H  1.549922 -1.072073 5.148684
H  0.454221 -0.713568 6.480785
H  0.702751 0.523715 -1.999184
H  3.689886 -2.053034 -3.688258
H  0.472075 1.664668 -4.155168
H  3.464005 -0.884804 -5.850511
H  1.84393 0.974421 -6.10053
elementType: Si F O C H
totalener: -1510.05008796 hartree
nucrepener: 3032.51010668 hartree
electener: -4542.56019464 hartree
oneelecener: -8095.65997500 hartree
twoeener: 3553.09978035 hartree
cpcmener: -0.03036586 hartree
kineticenergy: 1503.90255647 hartree
xcener: -135.236333040671 hartree
chargesum: -0.0000000
charge: 0.453893 -0.223352 -0.346552 -0.344055 -0.240035 -0.135595 -0.144067 -0.441791 -0.419237 -0.095796 -0.144622 -0.125997 0.102770 -0.239727 -0.265695 0.326867 -0.259378 -0.305057 0.265957 -0.125323 0.156214 0.056500 -0.283896 0.259942 -0.129987 -0.227061 -0.186842 -0.145921 -0.164846 0.100849 0.063555 0.091528 0.068932 0.106499 0.106176 0.101306 0.082748 0.106344 0.109388 0.094564 0.086909 0.145001 0.145567 0.140533 0.126400 0.150470 0.142339 0.162396 0.086685 0.109127 0.090492 0.091051 0.106091 0.126328 0.147652 0.160554 0.161375 0.161826
qa: 0.4539 -0.2234 -0.3466 -0.3441 -0.2400 -0.1356 -0.1441 -0.4418 -0.4192 -0.0958 -0.1446 -0.1260 0.1028 -0.2397 -0.2657 0.3269 -0.2594 -0.3051 0.2660 -0.1253 0.1562 0.0565 -0.2839 0.2599 -0.1300 -0.2271 -0.1868 -0.1459 -0.1648 0.1008 0.0636 0.0915 0.0689 0.1065 0.1062 0.1013 0.0827 0.1063 0.1094 0.0946 0.0869 0.1450 0.1456 0.1405 0.1264 0.1505 0.1423 0.1624 0.0867 0.1091 0.0905 0.0911 0.1061 0.1263 0.1477 0.1606 0.1614 0.1618
va: 4.1218 1.0581 2.0495 2.0728 3.8106 3.9017 3.6431 3.9185 3.9065 3.8562 3.8489 3.8342 3.5565 3.8712 3.9712 3.6878 3.9414 3.9074 3.6054 3.7427 4.0915 3.8442 3.9138 3.7497 3.8423 3.9619 3.9099 3.9046 3.8952 1.0109 1.0157 1.0115 1.0048 1.0095 1.0104 1.0105 1.0145 1.0109 1.0109 1.0066 1.0086 0.9851 0.9694 1.0058 1.0204 1.0011 1.0070 0.9869 0.9967 0.9921 0.9994 1.0032 1.0113 0.9927 1.0072 0.9916 0.9877 0.9894
dispcorr: -0.036774616 hartree
energy: -1510.086862580115
dipole: -26.85942 24.92997 -1.92945 7.15922 -7.43378 -0.27456 3.60022 -3.29612 0.30410
magnitude: 1.97247 au
magnitude: 5.01361 debye
