program: Orca
programVersion: 5.0.2
elementType: Si F O O C C C C C C C C C C C C C C C C C C C C C C C C C H H H H H H H H H H H H H H H H H H H H H H H H H H H H H
charge: 0
multiplicity: 1
keywords: wb97x-d3
keywords: def2-TZVPP
keywords: def2/J RIJCOSX
keywords: DEFGRID2
keywords: scfconv7
keywords: smallprint printgap noloewdin
keywords: NOSOSCF
formula: C25H29FO2Si
InChI: InChI=1/C25H29FO2Si/c1-4-27-21-13-15-23(16-14-21)29(2,3)18-8-9-20-12-17-24(26)25(19-20)28-22-10-6-5-7-11-22/h5-7,10-17,19H,4,8-9,18H2,1-3H3
58 atoms
Si -2.806343 1.603325 -0.691353
F  3.135862 -1.810541 1.10478
O  1.187343 1.710624 3.858033
O  2.397276 -1.986502 -1.451779
C  -2.325209 0.192811 -1.858687
C  -2.773813 -1.221619 -1.479425
C  -1.61805 1.663797 0.766225
C  -4.569704 1.389331 -0.072057
C  -2.633856 3.217851 -1.647856
C  -2.363916 -1.724072 -0.096507
C  -0.24658 1.849128 0.551137
C  -2.027774 1.499961 2.086971
C  -0.887643 -1.760159 0.205207
C  0.663322 1.860421 1.591621
C  -1.132079 1.504969 3.151644
C  0.226401 1.682558 2.906748
C  0.066953 -1.859487 -0.801207
C  -0.451617 -1.713863 1.528758
C  1.422263 -1.869262 -0.501086
C  0.897886 -1.745325 1.842826
C  1.823787 -1.806233 0.823018
C  0.862365 1.376407 5.203615
C  0.682062 -0.111705 5.412863
C  2.274893 -1.295368 -2.632682
C  1.754456 -0.008422 -2.692772
C  2.744161 -1.925722 -3.775757
C  1.690925 0.636879 -3.919628
C  2.686931 -1.262043 -4.992933
C  2.152465 0.016606 -5.073142
H  -2.748039 0.432258 -2.840508
H  -1.239915 0.232085 -2.004681
H  -2.424575 -1.928158 -2.238891
H  -3.864923 -1.269954 -1.524091
H  -4.880529 2.222384 0.561428
H  -5.26777 1.343654 -0.910643
H  -4.697773 0.471807 0.505496
H  -3.302257 3.246504 -2.510969
H  -2.867139 4.081692 -1.022378
H  -1.616123 3.351746 -2.021189
H  -2.855112 -1.125637 0.676134
H  -2.766826 -2.734455 0.027737
H  0.133441 1.984139 -0.456623
H  -3.077023 1.350509 2.315335
H  1.719683 1.998357 1.394768
H  -1.514951 1.362792 4.153247
H  -0.238714 -1.923032 -1.838231
H  -1.176077 -1.639126 2.330183
H  1.232045 -1.70046 2.87159
H  -0.015096 1.934729 5.541487
H  1.708114 1.733252 5.790844
H  0.493004 -0.303728 6.469588
H  -0.158344 -0.518233 4.849667
H  1.581891 -0.659225 5.13116
H  1.399657 0.492744 -1.800468
H  3.150947 -2.926885 -3.711665
H  1.279562 1.636638 -3.967811
H  3.053586 -1.755821 -5.883222
H  2.098891 0.526949 -6.025335
elementType: Si F O C H
totalener: -1510.05057597 hartree
nucrepener: 3014.32213340 hartree
electener: -4524.37270937 hartree
oneelecener: -8059.19483117 hartree
twoeener: 3534.82212180 hartree
cpcmener: -0.03024763 hartree
kineticenergy: 1503.89707863 hartree
xcener: -135.236800913890 hartree
chargesum: 0.0000000
charge: 0.480228 -0.221555 -0.349161 -0.343729 -0.227485 -0.150278 -0.106012 -0.440167 -0.457089 -0.080547 -0.132291 -0.154188 0.044583 -0.334849 -0.230083 0.355039 -0.227743 -0.234848 0.222958 -0.183345 0.191537 0.056915 -0.278793 0.283368 -0.185885 -0.236787 -0.175413 -0.135639 -0.172566 0.097318 0.042340 0.083709 0.091428 0.111105 0.113399 0.106315 0.102088 0.101268 0.101614 0.079471 0.101480 0.148979 0.144943 0.130165 0.139755 0.153777 0.145485 0.156310 0.085553 0.110149 0.103406 0.088653 0.089085 0.165476 0.147522 0.160413 0.161278 0.161342
qa: 0.4802 -0.2216 -0.3492 -0.3437 -0.2275 -0.1503 -0.1060 -0.4402 -0.4571 -0.0805 -0.1323 -0.1542 0.0446 -0.3348 -0.2301 0.3550 -0.2277 -0.2348 0.2230 -0.1833 0.1915 0.0569 -0.2788 0.2834 -0.1859 -0.2368 -0.1754 -0.1356 -0.1726 0.0973 0.0423 0.0837 0.0914 0.1111 0.1134 0.1063 0.1021 0.1013 0.1016 0.0795 0.1015 0.1490 0.1449 0.1302 0.1398 0.1538 0.1455 0.1563 0.0856 0.1101 0.1034 0.0887 0.0891 0.1655 0.1475 0.1604 0.1613 0.1613
va: 4.1033 1.0651 2.0472 2.0738 3.8484 3.9058 3.6418 3.9145 3.9038 3.8213 3.8273 3.8290 3.6482 4.0068 3.8349 3.6502 3.8857 3.8632 3.6608 3.8154 4.0935 3.8447 3.9148 3.7013 3.8546 3.9870 3.9042 3.8871 3.8878 1.0125 1.0234 1.0011 0.9977 1.0088 1.0086 1.0065 1.0114 1.0096 1.0104 1.0079 1.0025 0.9783 0.9886 1.0168 1.0064 0.9939 0.9987 0.9948 0.9964 0.9916 1.0125 0.9996 1.0049 0.9845 1.0072 0.9923 0.9879 0.9889
dispcorr: -0.036144109 hartree
energy: -1510.086720078493
dipole: -27.76665 25.82092 -1.94573 10.93464 -10.87213 0.06251 2.53021 -2.20647 0.32375
magnitude: 1.97347 au
magnitude: 5.01616 debye
