program: Orca
programVersion: 5.0.2
elementType: Si F O O C C C C C C C C C C C C C C C C C C C C C C C C C H H H H H H H H H H H H H H H H H H H H H H H H H H H H H
charge: 0
multiplicity: 1
keywords: wb97x-d3
keywords: def2-TZVPP
keywords: def2/J RIJCOSX
keywords: DEFGRID2
keywords: scfconv7
keywords: smallprint printgap noloewdin
keywords: NOSOSCF
formula: C25H29FO2Si
InChI: InChI=1/C25H29FO2Si/c1-4-27-21-13-15-23(16-14-21)29(2,3)18-8-9-20-12-17-24(26)25(19-20)28-22-10-6-5-7-11-22/h5-7,10-17,19H,4,8-9,18H2,1-3H3
58 atoms
Si -3.591964 -0.050331 1.548425
F  1.468647 2.068014 -2.349457
O  1.80985 2.638235 1.103113
O  1.977646 -0.117484 -0.918806
C  -3.934283 -0.734949 -0.17695
C  -3.067596 -1.953133 -0.532027
C  -1.888946 0.749311 1.475703
C  -3.589908 -1.420762 2.836388
C  -4.873517 1.259612 1.980086
C  -2.490343 -1.903438 -1.950226
C  -0.7733 0.24334 2.138586
C  -1.694139 1.900314 0.700812
C  -1.441685 -0.835182 -2.097169
C  0.480718 0.841157 2.048954
C  -0.460549 2.513066 0.596981
C  0.642233 1.983018 1.270045
C  -0.21365 -0.995349 -1.455886
C  -1.669325 0.330108 -2.820177
C  0.770622 -0.026289 -1.546485
C  -0.69275 1.31635 -2.909145
C  0.513962 1.127221 -2.27684
C  2.96606 2.176157 1.792087
C  4.118341 3.079303 1.430995
C  2.557647 -1.35863 -0.795108
C  2.770337 -2.159687 -1.909607
C  2.966929 -1.765947 0.464574
C  3.406472 -3.381584 -1.751385
C  3.61205 -2.987697 0.607094
C  3.830419 -3.799986 -0.496173
H  -4.993869 -0.977568 -0.294738
H  -3.7481 0.089055 -0.875527
H  -3.659962 -2.863639 -0.422438
H  -2.23007 -2.071167 0.164642
H  -3.363333 -1.036501 3.832861
H  -4.567705 -1.903919 2.890284
H  -2.85762 -2.198022 2.610067
H  -4.882291 2.071594 1.249873
H  -5.8786 0.83313 2.001919
H  -4.68415 1.702411 2.959719
H  -2.049427 -2.874581 -2.189759
H  -3.294612 -1.734954 -2.669921
H  -0.863477 -0.647623 2.749802
H  -2.526469 2.339264 0.160547
H  1.311435 0.401344 2.584303
H  -0.336871 3.402467 -0.009378
H  -0.025576 -1.894587 -0.88004
H  -2.616264 0.476603 -3.323853
H  -0.870132 2.22553 -3.469181
H  3.191319 1.144722 1.50729
H  2.791213 2.189938 2.872327
H  4.319778 3.060831 0.359812
H  3.933223 4.109818 1.733561
H  5.017013 2.737748 1.944251
H  2.448193 -1.833967 -2.89083
H  2.785063 -1.135182 1.325565
H  3.575079 -4.007669 -2.617516
H  3.936493 -3.305188 1.589341
H  4.329631 -4.752683 -0.380821
elementType: Si F O C H
totalener: -1510.05274799 hartree
nucrepener: 3051.38352518 hartree
electener: -4561.43627317 hartree
oneelecener: -8134.53514753 hartree
twoeener: 3573.09887436 hartree
cpcmener: -0.03106110 hartree
kineticenergy: 1503.92664146 hartree
xcener: -135.237311160181 hartree
chargesum: 0.0000000
charge: 0.474527 -0.226007 -0.340522 -0.339564 -0.268920 -0.121405 -0.141189 -0.434770 -0.443759 -0.098173 -0.150681 -0.143803 0.052957 -0.254721 -0.288258 0.373082 -0.211154 -0.221665 0.187136 -0.138221 0.170235 0.056199 -0.274122 0.270341 -0.163688 -0.224275 -0.159455 -0.163773 -0.163683 0.097410 0.075907 0.095411 0.063320 0.108612 0.110497 0.101666 0.100202 0.103641 0.103233 0.097606 0.087007 0.144074 0.135777 0.143648 0.131236 0.145630 0.144037 0.146727 0.086753 0.103080 0.086119 0.089952 0.091076 0.155722 0.154773 0.162236 0.160086 0.161891
qa: 0.4745 -0.2260 -0.3405 -0.3396 -0.2689 -0.1214 -0.1412 -0.4348 -0.4438 -0.0982 -0.1507 -0.1438 0.0530 -0.2547 -0.2883 0.3731 -0.2112 -0.2217 0.1871 -0.1382 0.1702 0.0562 -0.2741 0.2703 -0.1637 -0.2243 -0.1595 -0.1638 -0.1637 0.0974 0.0759 0.0954 0.0633 0.1086 0.1105 0.1017 0.1002 0.1036 0.1032 0.0976 0.0870 0.1441 0.1358 0.1436 0.1312 0.1456 0.1440 0.1467 0.0868 0.1031 0.0861 0.0900 0.0911 0.1557 0.1548 0.1622 0.1601 0.1619
va: 4.1326 1.0528 2.0458 2.0115 3.8357 3.8698 3.6866 3.9109 3.9032 3.8571 3.8547 3.8544 3.6140 3.8371 3.9900 3.6242 3.8623 3.8736 3.5418 3.8601 4.0105 3.8005 3.9713 3.7036 3.9221 3.9415 3.9013 3.9386 3.8813 1.0107 1.0173 1.0078 1.0065 1.0078 1.0088 1.0086 1.0108 1.0101 1.0089 1.0051 1.0069 0.9884 0.9925 1.0099 1.0159 1.0075 1.0023 0.9996 0.9782 0.9909 1.0048 1.0041 1.0057 0.9970 0.9966 0.9891 0.9909 0.9883
dispcorr: -0.035876654 hartree
energy: -1510.088624649443
dipole: -15.53745 15.19416 -0.34329 -8.05777 6.33952 -1.71824 15.50833 -15.17645 0.33188
magnitude: 1.78335 au
magnitude: 4.53293 debye
