program: Orca
programVersion: 5.0.2
elementType: Si F O O C C C C C C C C C C C C C C C C C C C C C C C C C H H H H H H H H H H H H H H H H H H H H H H H H H H H H H
charge: 0
multiplicity: 1
keywords: wb97x-d3
keywords: def2-TZVPP
keywords: def2/J RIJCOSX
keywords: DEFGRID2
keywords: scfconv7
keywords: smallprint printgap noloewdin
keywords: NOSOSCF
formula: C25H29FO2Si
InChI: InChI=1/C25H29FO2Si/c1-4-27-21-13-15-23(16-14-21)29(2,3)18-8-9-20-12-17-24(26)25(19-20)28-22-10-6-5-7-11-22/h5-7,10-17,19H,4,8-9,18H2,1-3H3
58 atoms
Si -4.18225 0.942967 0.648066
F  1.982085 -1.38391 1.312109
O  1.681325 1.818588 1.842175
O  1.668187 -0.13444 -1.099925
C  -4.233203 -0.804849 -0.065777
C  -3.612218 -0.922786 -1.466275
C  -2.37367 1.320945 1.009222
C  -5.147098 0.991245 2.263309
C  -4.864799 2.193141 -0.579483
C  -2.729597 -2.164975 -1.649346
C  -1.599427 2.180897 0.233789
C  -1.727254 0.678987 2.073948
C  -1.44542 -2.045689 -0.877434
C  -0.246299 2.394738 0.482453
C  -0.386264 0.873111 2.340374
C  0.371865 1.7239 1.533505
C  -0.435453 -1.211208 -1.356472
C  -1.246316 -2.691577 0.337862
C  0.722885 -1.005448 -0.632011
C  -0.0875 -2.489103 1.079692
C  0.875116 -1.632626 0.597215
C  2.535716 2.616073 1.030195
C  3.959782 2.306886 1.419079
C  2.901329 -0.602792 -1.46954
C  3.852508 0.365525 -1.772631
C  3.212389 -1.952154 -1.572895
C  5.124052 -0.022373 -2.161973
C  4.494087 -2.323271 -1.960579
C  5.456031 -1.36849 -2.252671
H  -3.698853 -1.44097 0.649204
H  -5.258171 -1.18607 -0.076197
H  -3.004596 -0.045213 -1.71512
H  -4.407809 -0.942036 -2.213735
H  -5.088993 1.971765 2.739403
H  -6.203349 0.766608 2.100852
H  -4.767926 0.257758 2.977946
H  -4.806563 3.212629 -0.193683
H  -4.32775 2.17053 -1.529682
H  -5.914925 1.987291 -0.797016
H  -3.27677 -3.056637 -1.335072
H  -2.503488 -2.28811 -2.711259
H  -2.047874 2.712996 -0.597649
H  -2.277731 -0.002129 2.714328
H  0.302152 3.075964 -0.154086
H  0.090744 0.353153 3.162407
H  -0.552795 -0.702017 -2.306335
H  -2.00767 -3.357597 0.723684
H  0.053615 -2.976866 2.035505
H  2.309931 3.677044 1.177809
H  2.378764 2.392571 -0.027899
H  4.640345 2.891467 0.80066
H  4.157938 2.557145 2.461593
H  4.190667 1.252028 1.264627
H  3.595657 1.415134 -1.705194
H  2.477705 -2.720198 -1.369085
H  5.859875 0.736545 -2.393195
H  4.733914 -3.375842 -2.034972
H  6.451454 -1.667918 -2.551407
elementType: Si F O C H
totalener: -1510.05314328 hartree
nucrepener: 3043.23650048 hartree
electener: -4553.28964376 hartree
oneelecener: -8118.29147376 hartree
twoeener: 3565.00183000 hartree
cpcmener: -0.02983551 hartree
kineticenergy: 1503.92383259 hartree
xcener: -135.236250330453 hartree
chargesum: -0.0000000
charge: 0.481000 -0.225834 -0.340072 -0.334327 -0.277198 -0.127514 -0.155670 -0.447111 -0.429981 -0.093394 -0.149051 -0.129905 0.074313 -0.231482 -0.288782 0.348957 -0.259851 -0.200165 0.174587 -0.153785 0.247346 0.044048 -0.282525 0.358141 -0.332475 -0.212509 -0.104866 -0.161559 -0.199293 0.079508 0.097133 0.066931 0.095496 0.103287 0.104138 0.100233 0.109397 0.100915 0.110046 0.089725 0.095689 0.144558 0.137347 0.140052 0.133069 0.132394 0.146924 0.146990 0.117969 0.074588 0.096511 0.100300 0.082371 0.169601 0.151974 0.160012 0.161939 0.159858
qa: 0.4810 -0.2258 -0.3401 -0.3343 -0.2772 -0.1275 -0.1557 -0.4471 -0.4300 -0.0934 -0.1491 -0.1299 0.0743 -0.2315 -0.2888 0.3490 -0.2599 -0.2002 0.1746 -0.1538 0.2473 0.0440 -0.2825 0.3581 -0.3325 -0.2125 -0.1049 -0.1616 -0.1993 0.0795 0.0971 0.0669 0.0955 0.1033 0.1041 0.1002 0.1094 0.1009 0.1100 0.0897 0.0957 0.1446 0.1373 0.1401 0.1331 0.1324 0.1469 0.1470 0.1180 0.0746 0.0965 0.1003 0.0824 0.1696 0.1520 0.1600 0.1619 0.1599
va: 4.1378 1.0472 2.0385 2.0106 3.8245 3.8744 3.6904 3.9053 3.9091 3.8476 3.8522 3.8374 3.5529 3.8456 3.9834 3.6674 4.0179 3.8830 3.5696 3.9002 3.8887 3.7882 3.9624 3.6477 3.9613 3.9035 3.8821 3.9065 3.9139 1.0163 1.0110 1.0056 1.0077 1.0091 1.0102 1.0112 1.0073 1.0090 1.0083 1.0068 1.0064 0.9866 0.9921 1.0093 1.0164 1.0187 0.9998 1.0011 0.9936 0.9915 1.0057 1.0054 1.0027 0.9893 1.0049 0.9898 0.9896 0.9896
dispcorr: -0.036314612 hartree
energy: -1510.089457895685
dipole: -18.97549 18.39995 -0.57554 8.98000 -9.29249 -0.31248 -2.92841 1.93168 -0.99672
magnitude: 1.19262 au
magnitude: 3.03141 debye
