program: Orca
programVersion: 5.0.2
elementType: Si F O O C C C C C C C C C C C C C C C C C C C C C C C C C H H H H H H H H H H H H H H H H H H H H H H H H H H H H H
charge: 0
multiplicity: 1
keywords: wb97x-d3
keywords: def2-TZVPP
keywords: def2/J RIJCOSX
keywords: DEFGRID2
keywords: scfconv7
keywords: smallprint printgap noloewdin
keywords: NOSOSCF
formula: C25H29FO2Si
InChI: InChI=1/C25H29FO2Si/c1-4-27-21-13-15-23(16-14-21)29(2,3)18-8-9-20-12-17-24(26)25(19-20)28-22-10-6-5-7-11-22/h5-7,10-17,19H,4,8-9,18H2,1-3H3
58 atoms
Si -3.734234 1.648142 0.717255
F  1.475996 -5.200158 -0.339592
O  2.062901 2.976615 -0.403945
O  1.897725 -2.824987 0.81154
C  -4.285525 0.101934 -0.225945
C  -3.337277 -1.096892 -0.111617
C  -1.937756 2.081752 0.357998
C  -3.906168 1.296833 2.558721
C  -4.829264 3.091489 0.208826
C  -2.251206 -1.085424 -1.188922
C  -0.8881 1.609457 1.155351
C  -1.586953 2.870998 -0.736859
C  -1.248719 -2.18545 -0.995264
C  0.434691 1.906254 0.877107
C  -0.267133 3.189103 -1.035046
C  0.75503 2.71056 -0.218857
C  -0.123313 -1.966355 -0.20677
C  -1.445393 -3.448724 -1.546127
C  0.798446 -2.977791 0.015073
C  -0.53596 -4.472365 -1.322186
C  0.580492 -4.224448 -0.552758
C  2.461739 3.771863 -1.514781
C  3.965466 3.887398 -1.491983
C  2.63059 -1.664316 0.726529
C  3.125013 -1.142411 1.911921
C  2.919717 -1.063433 -0.492537
C  3.928256 -0.010219 1.874497
C  3.715526 0.072043 -0.512574
C  4.223695 0.603531 0.66581
H  -5.270002 -0.161199 0.176141
H  -4.45928 0.341684 -1.28033
H  -3.895795 -2.03352 -0.198236
H  -2.864075 -1.127309 0.876162
H  -3.329569 0.421347 2.86496
H  -3.570551 2.138477 3.167428
H  -4.948703 1.100043 2.817745
H  -4.581483 4.002155 0.757345
H  -4.737062 3.31441 -0.856094
H  -5.881334 2.869875 0.400184
H  -2.726002 -1.185608 -2.168286
H  -1.73974 -0.120767 -1.185687
H  -1.097205 0.990718 2.02069
H  -2.356974 3.264938 -1.390987
H  1.227607 1.525182 1.510778
H  -0.058571 3.811543 -1.894702
H  0.035694 -0.989736 0.237132
H  -2.316369 -3.639685 -2.160361
H  -0.684071 -5.454021 -1.753499
H  2.001788 4.763173 -1.451483
H  2.128126 3.310587 -2.449627
H  4.446396 2.915607 -1.607849
H  4.289147 4.51813 -2.319628
H  4.319224 4.344383 -0.567588
H  2.889124 -1.620386 2.85415
H  2.538784 -1.474111 -1.418981
H  4.314639 0.396256 2.79987
H  3.942956 0.540543 -1.461452
H  4.843269 1.490166 0.639956
elementType: Si F O C H
totalener: -1510.05321877 hartree
nucrepener: 2936.10952191 hartree
electener: -4446.16274068 hartree
oneelecener: -7902.85136220 hartree
twoeener: 3456.68862152 hartree
cpcmener: -0.02788585 hartree
kineticenergy: 1503.91758777 hartree
xcener: -135.233185331525 hartree
chargesum: 0.0000000
charge: 0.496186 -0.220858 -0.332825 -0.344344 -0.271593 -0.142238 -0.161087 -0.431074 -0.462285 -0.062992 -0.113788 -0.134859 -0.008924 -0.310541 -0.259082 0.356692 -0.168780 -0.205887 0.177962 -0.176990 0.188719 0.050666 -0.293631 0.272857 -0.244266 -0.157422 -0.127020 -0.181071 -0.186075 0.093641 0.080039 0.094910 0.081028 0.100296 0.109445 0.107457 0.105327 0.101803 0.104518 0.093206 0.086915 0.141924 0.138987 0.151396 0.141759 0.148252 0.144145 0.149827 0.104956 0.099508 0.086607 0.100978 0.092473 0.148083 0.155693 0.158853 0.169317 0.163209
qa: 0.4962 -0.2209 -0.3328 -0.3443 -0.2716 -0.1422 -0.1611 -0.4311 -0.4623 -0.0630 -0.1138 -0.1349 -0.0089 -0.3105 -0.2591 0.3567 -0.1688 -0.2059 0.1780 -0.1770 0.1887 0.0507 -0.2936 0.2729 -0.2443 -0.1574 -0.1270 -0.1811 -0.1861 0.0936 0.0800 0.0949 0.0810 0.1003 0.1094 0.1075 0.1053 0.1018 0.1045 0.0932 0.0869 0.1419 0.1390 0.1514 0.1418 0.1483 0.1441 0.1498 0.1050 0.0995 0.0866 0.1010 0.0925 0.1481 0.1557 0.1589 0.1693 0.1632
va: 4.1323 1.0638 2.0678 2.0625 3.8306 3.8733 3.7203 3.8907 3.9138 3.7500 3.8181 3.8911 3.6772 3.9854 3.9272 3.7663 3.8681 3.9093 3.7002 3.8849 4.0425 3.7914 3.9662 3.6761 3.9891 3.8905 3.8848 3.8490 3.8442 1.0098 1.0127 1.0070 1.0027 1.0107 1.0065 1.0095 1.0098 1.0114 1.0100 1.0127 1.0144 0.9919 0.9922 1.0043 1.0094 1.0064 1.0015 0.9979 0.9874 0.9864 0.9992 1.0084 1.0014 1.0063 0.9979 0.9892 0.9823 0.9864
dispcorr: -0.033301386 hartree
energy: -1510.086520155033
dipole: -17.78516 17.02035 -0.76481 31.18854 -29.47219 1.71635 -2.28670 1.08299 -1.20371
magnitude: 2.23153 au
magnitude: 5.67209 debye
