program: Orca
programVersion: 5.0.2
elementType: Si F O O C C C C C C C C C C C C C C C C C C C C C C C C C H H H H H H H H H H H H H H H H H H H H H H H H H H H H H
charge: 0
multiplicity: 1
keywords: wb97x-d3
keywords: def2-TZVPP
keywords: def2/J RIJCOSX
keywords: DEFGRID2
keywords: scfconv7
keywords: smallprint printgap noloewdin
keywords: NOSOSCF
formula: C25H29FO2Si
InChI: InChI=1/C25H29FO2Si/c1-4-27-21-13-15-23(16-14-21)29(2,3)18-8-9-20-12-17-24(26)25(19-20)28-22-10-6-5-7-11-22/h5-7,10-17,19H,4,8-9,18H2,1-3H3
58 atoms
Si -4.108897 0.963775 0.924943
F  1.338684 -0.84369 -3.15763
O  1.707675 2.605911 1.063708
O  1.765122 -0.548165 -0.455742
C  -3.946937 -0.805289 0.283763
C  -3.120756 -1.697008 1.214953
C  -2.340463 1.600766 1.017277
C  -4.888122 0.997437 2.635752
C  -5.106135 2.004734 -0.28387
C  -2.423121 -2.861513 0.503525
C  -1.6911 1.849859 2.223153
C  -1.574089 1.726959 -0.149174
C  -1.398127 -2.380446 -0.486024
C  -0.34491 2.197107 2.287015
C  -0.236095 2.070546 -0.113241
C  0.394469 2.298016 1.1125
C  -0.236125 -1.751895 -0.03841
C  -1.599693 -2.499649 -1.856537
C  0.68778 -1.23991 -0.931777
C  -0.6772 -1.995675 -2.765815
C  0.449103 -1.359684 -2.295814
C  2.401474 2.845893 2.283851
C  3.842147 3.147379 1.956405
C  3.033035 -0.911237 -0.829901
C  3.995106 0.089111 -0.785173
C  3.371461 -2.206703 -1.195323
C  5.307553 -0.212062 -1.114355
C  4.689194 -2.489846 -1.5314
C  5.661463 -1.500008 -1.49552
H  -4.926717 -1.255236 0.097483
H  -3.467648 -0.730292 -0.699627
H  -3.765116 -2.097672 2.001047
H  -2.352354 -1.114796 1.734698
H  -4.943642 2.010782 3.038265
H  -5.907853 0.607949 2.599618
H  -4.334813 0.387776 3.352523
H  -6.122006 1.620329 -0.397019
H  -5.183429 3.042129 0.047135
H  -4.650522 2.011452 -1.276546
H  -1.941996 -3.496781 1.251785
H  -3.163624 -3.481012 -0.007765
H  -2.233657 1.768462 3.158324
H  -2.024315 1.54122 -1.118971
H  0.104321 2.373749 3.254824
H  0.333856 2.153171 -1.030939
H  -0.047671 -1.641529 1.02354
H  -2.492694 -2.986488 -2.227616
H  -0.841533 -2.082231 -3.832143
H  2.334259 1.968273 2.934787
H  1.946176 3.688023 2.815038
H  4.385365 3.344679 2.88073
H  4.326482 2.305852 1.459645
H  3.934753 4.028724 1.321326
H  3.712684 1.094041 -0.497199
H  2.629346 -2.995283 -1.217154
H  6.054465 0.570384 -1.080385
H  4.953343 -3.498758 -1.820479
H  6.685039 -1.729881 -1.759497
elementType: Si F O C H
totalener: -1510.05376020 hartree
nucrepener: 2967.84617250 hartree
electener: -4477.89993269 hartree
oneelecener: -7967.40264926 hartree
twoeener: 3489.50271657 hartree
cpcmener: -0.02841510 hartree
kineticenergy: 1503.91668862 hartree
xcener: -135.232153374427 hartree
chargesum: -0.0000000
charge: 0.495322 -0.221056 -0.344185 -0.330935 -0.265631 -0.129547 -0.176758 -0.443092 -0.435492 -0.091422 -0.136575 -0.111130 0.036527 -0.251485 -0.323482 0.382830 -0.256652 -0.189249 0.154976 -0.156589 0.259854 0.055446 -0.280798 0.292963 -0.259738 -0.182873 -0.139479 -0.161417 -0.183980 0.094481 0.075120 0.093949 0.070875 0.109305 0.110063 0.103942 0.103472 0.102699 0.100811 0.099202 0.084543 0.145979 0.135413 0.141279 0.134567 0.137000 0.146560 0.150377 0.096849 0.101758 0.097063 0.084945 0.090462 0.147335 0.155223 0.159353 0.161216 0.159809
qa: 0.4953 -0.2211 -0.3442 -0.3309 -0.2656 -0.1295 -0.1768 -0.4431 -0.4355 -0.0914 -0.1366 -0.1111 0.0365 -0.2515 -0.3235 0.3828 -0.2567 -0.1892 0.1550 -0.1566 0.2599 0.0554 -0.2808 0.2930 -0.2597 -0.1829 -0.1395 -0.1614 -0.1840 0.0945 0.0751 0.0939 0.0709 0.1093 0.1101 0.1039 0.1035 0.1027 0.1008 0.0992 0.0845 0.1460 0.1354 0.1413 0.1346 0.1370 0.1466 0.1504 0.0968 0.1018 0.0971 0.0849 0.0905 0.1473 0.1552 0.1594 0.1612 0.1598
va: 4.1323 1.0618 2.0492 2.0178 3.8381 3.8674 3.7345 3.9190 3.8975 3.8521 3.8783 3.8167 3.6208 3.9227 3.9844 3.6810 3.9300 3.8595 3.6031 3.9075 3.9669 3.7945 3.9622 3.6814 3.9675 3.8940 3.9184 3.9106 3.8948 1.0135 1.0144 1.0070 1.0061 1.0079 1.0087 1.0059 1.0099 1.0089 1.0100 1.0050 1.0075 0.9891 0.9926 1.0100 1.0150 1.0157 1.0009 0.9978 0.9867 0.9872 1.0067 1.0010 1.0039 1.0195 1.0008 0.9911 0.9896 0.9893
dispcorr: -0.033106647 hartree
energy: -1510.086866844044
dipole: -16.87144 16.38534 -0.48610 6.78130 -7.51816 -0.73686 18.69487 -17.64951 1.04536
magnitude: 1.36823 au
magnitude: 3.47776 debye
