program: Orca
programVersion: 5.0.2
elementType: Si F O O C C C C C C C C C C C C C C C C C C C C C C C C C H H H H H H H H H H H H H H H H H H H H H H H H H H H H H
charge: 0
multiplicity: 1
keywords: wb97x-d3
keywords: def2-TZVPP
keywords: def2/J RIJCOSX
keywords: DEFGRID2
keywords: scfconv7
keywords: smallprint printgap noloewdin
keywords: NOSOSCF
formula: C25H29FO2Si
InChI: InChI=1/C25H29FO2Si/c1-4-27-21-13-15-23(16-14-21)29(2,3)18-8-9-20-12-17-24(26)25(19-20)28-22-10-6-5-7-11-22/h5-7,10-17,19H,4,8-9,18H2,1-3H3
58 atoms
Si -3.81348 1.644497 0.488493
F  1.739283 -4.766464 -0.722334
O  2.141284 2.719918 0.633807
O  2.047462 -2.23587 0.080122
C  -4.240986 -0.09837 1.118327
C  -3.154674 -1.157916 0.950664
C  -1.949751 1.916927 0.532906
C  -4.641384 2.894203 1.629968
C  -4.441579 1.902907 -1.268015
C  -2.75557 -1.408047 -0.503891
C  -1.226732 1.750832 1.714288
C  -1.222903 2.312601 -0.595568
C  -1.565269 -2.317871 -0.602771
C  0.141799 1.981552 1.791065
C  0.138198 2.556927 -0.543881
C  0.832041 2.411531 0.658544
C  -0.305857 -1.831805 -0.258098
C  -1.687446 -3.651699 -0.976935
C  0.807374 -2.653299 -0.301762
C  -0.579845 -4.487945 -1.01638
C  0.65682 -3.97831 -0.686116
C  2.879718 2.708161 1.849119
C  4.214962 3.363954 1.599221
C  2.659896 -1.190018 -0.54939
C  2.220697 -0.637799 -1.745655
C  3.806537 -0.705657 0.071172
C  2.932173 0.416339 -2.305955
C  4.513287 0.333224 -0.511057
C  4.076217 0.908674 -1.697618
H  -4.497632 -0.019893 2.180006
H  -5.162933 -0.423102 0.622017
H  -3.481653 -2.105063 1.391645
H  -2.266245 -0.858035 1.513197
H  -4.257513 2.820767 2.650147
H  -4.479103 3.920273 1.293338
H  -5.721264 2.733467 1.679369
H  -4.255071 2.918834 -1.622855
H  -3.990105 1.214432 -1.985072
H  -5.521982 1.744325 -1.309644
H  -3.600683 -1.831312 -1.052551
H  -2.514047 -0.459103 -0.991336
H  -1.732387 1.434693 2.621039
H  -1.726204 2.447279 -1.546355
H  0.644804 1.831862 2.736989
H  0.671914 2.878676 -1.430297
H  -0.189798 -0.796431 0.047206
H  -2.659045 -4.050153 -1.241351
H  -0.675235 -5.526149 -1.307916
H  3.009847 1.678999 2.200842
H  2.340077 3.258153 2.627008
H  4.784953 2.851435 0.824626
H  4.096562 4.407752 1.306188
H  4.804109 3.339685 2.516251
H  1.339475 -1.010961 -2.250207
H  4.14505 -1.15148 0.998291
H  2.582226 0.84865 -3.234658
H  5.41059 0.697291 -0.027579
H  4.623151 1.729575 -2.142139
elementType: Si F O C H
totalener: -1510.06889045 hartree
nucrepener: 2966.19149683 hartree
electener: -4476.26038728 hartree
oneelecener: -7962.94256702 hartree
twoeener: 3486.68217974 hartree
cpcmener: -0.02406695 hartree
kineticenergy: 1503.91732695 hartree
xcener: -135.233890002359 hartree
chargesum: -0.0000000
charge: 0.478307 -0.216413 -0.318503 -0.326149 -0.291068 -0.131852 -0.122853 -0.447340 -0.428928 -0.063346 -0.217219 -0.089077 0.015732 -0.191093 -0.297371 0.321550 -0.192976 -0.182827 0.195823 -0.175917 0.193888 0.018752 -0.271142 0.342526 -0.208333 -0.257404 -0.167777 -0.137423 -0.188589 0.099206 0.087520 0.093486 0.081558 0.099803 0.099772 0.101281 0.106444 0.105654 0.108793 0.095148 0.081200 0.139073 0.142896 0.137371 0.133301 0.099340 0.139445 0.147414 0.105733 0.113948 0.083911 0.090748 0.092795 0.153453 0.142960 0.157519 0.162707 0.154542
qa: 0.4783 -0.2164 -0.3185 -0.3261 -0.2911 -0.1319 -0.1229 -0.4473 -0.4289 -0.0633 -0.2172 -0.0891 0.0157 -0.1911 -0.2974 0.3215 -0.1930 -0.1828 0.1958 -0.1759 0.1939 0.0188 -0.2711 0.3425 -0.2083 -0.2574 -0.1678 -0.1374 -0.1886 0.0992 0.0875 0.0935 0.0816 0.0998 0.0998 0.1013 0.1064 0.1057 0.1088 0.0951 0.0812 0.1391 0.1429 0.1374 0.1333 0.0993 0.1394 0.1474 0.1057 0.1139 0.0839 0.0907 0.0928 0.1535 0.1430 0.1575 0.1627 0.1545
va: 4.0856 1.0715 2.0537 2.0946 3.8594 3.8556 3.7094 3.9003 3.8982 3.7295 3.9332 3.8092 3.6592 3.8573 3.9880 3.7210 3.9219 3.8986 3.6882 3.8786 4.0587 3.7923 3.9591 3.6398 3.8435 3.9395 3.8743 3.8408 3.8720 1.0079 1.0123 1.0106 1.0078 1.0111 1.0115 1.0096 1.0075 1.0088 1.0111 1.0140 1.0229 0.9919 0.9890 1.0093 1.0134 1.0295 1.0044 0.9989 0.9840 0.9916 1.0059 1.0039 1.0066 0.9998 1.0111 0.9910 0.9816 0.9918
dispcorr: -0.034097141 hartree
energy: -1510.102987591978
dipole: -18.47051 17.63093 -0.83957 27.06930 -26.28496 0.78434 7.36167 -6.91477 0.44690
magnitude: 1.23280 au
magnitude: 3.13352 debye
