program: Orca
programVersion: 5.0.2
elementType: Si F O O C C C C C C C C C C C C C C C C C C C C C C C C C H H H H H H H H H H H H H H H H H H H H H H H H H H H H H
charge: 0
multiplicity: 1
keywords: wb97x-d3
keywords: def2-TZVPP
keywords: def2/J RIJCOSX
keywords: DEFGRID2
keywords: scfconv7
keywords: smallprint printgap noloewdin
keywords: NOSOSCF
formula: C25H29FO2Si
InChI: InChI=1/C25H29FO2Si/c1-4-27-21-13-15-23(16-14-21)29(2,3)18-8-9-20-12-17-24(26)25(19-20)28-22-10-6-5-7-11-22/h5-7,10-17,19H,4,8-9,18H2,1-3H3
58 atoms
Si -2.657824 1.589078 -0.761005
F  1.76282 -4.546102 -0.582398
O  2.27151 2.752517 2.556932
O  2.043087 -1.87598 -0.592366
C  -2.931605 -0.265959 -1.049608
C  -3.479367 -1.097823 0.111979
C  -1.148292 1.978916 0.294885
C  -4.183231 2.306105 0.078496
C  -2.407962 2.380081 -2.452387
C  -2.492002 -1.367683 1.254345
C  0.128244 2.097512 -0.267533
C  -1.239545 2.145752 1.676342
C  -1.332356 -2.21911 0.821652
C  1.247218 2.352983 0.505072
C  -0.129861 2.394459 2.47402
C  1.129921 2.496635 1.888322
C  -0.158911 -1.637921 0.353387
C  -1.429272 -3.609437 0.826133
C  0.879461 -2.419347 -0.130333
C  -0.38715 -4.402689 0.370734
C  0.75311 -3.79834 -0.117361
C  2.297209 2.67767 3.977442
C  2.246347 1.254925 4.492426
C  1.98289 -0.959695 -1.606825
C  0.983666 -0.969702 -2.572776
C  3.003551 -0.020041 -1.656477
C  1.009763 -0.018309 -3.583471
C  3.019358 0.91937 -2.676213
C  2.02024 0.931433 -3.640449
H  -3.651036 -0.318347 -1.875852
H  -2.01548 -0.713438 -1.450704
H  -3.831846 -2.063095 -0.266313
H  -4.362036 -0.606752 0.532206
H  -5.084547 2.087426 -0.499313
H  -4.341694 1.901444 1.080316
H  -4.113672 3.391726 0.175092
H  -1.565503 1.938259 -2.989704
H  -3.291617 2.246719 -3.08081
H  -2.219675 3.453008 -2.376494
H  -2.126408 -0.425136 1.666628
H  -3.028398 -1.87171 2.061856
H  0.26615 1.987714 -1.338061
H  -2.203281 2.079262 2.169268
H  2.222949 2.442447 0.042783
H  -0.270751 2.508206 3.540586
H  -0.049653 -0.559227 0.35656
H  -2.329401 -4.085324 1.195851
H  -0.463023 -5.482604 0.381682
H  1.502652 3.288465 4.416625
H  3.241899 3.141569 4.261504
H  3.06535 0.661032 4.085021
H  2.348035 1.261452 5.578509
H  1.308789 0.751866 4.253721
H  0.193136 -1.709306 -2.552398
H  3.776647 -0.024442 -0.898112
H  0.231357 -0.029089 -4.335775
H  3.815973 1.651574 -2.709215
H  2.032409 1.669613 -4.431423
elementType: Si F O C H
totalener: -1510.06664361 hartree
nucrepener: 3014.85455103 hartree
electener: -4524.92119464 hartree
oneelecener: -8060.04362788 hartree
twoeener: 3535.12243324 hartree
cpcmener: -0.02257224 hartree
kineticenergy: 1503.91328373 hartree
xcener: -135.236308514479 hartree
chargesum: -0.0000000
charge: 0.442513 -0.217169 -0.335406 -0.332737 -0.251903 -0.146957 -0.169444 -0.438474 -0.437632 -0.110947 -0.085446 -0.103379 -0.007892 -0.270634 -0.270854 0.334797 -0.158973 -0.172146 0.164209 -0.194228 0.220436 0.041350 -0.259333 0.309572 -0.169432 -0.283437 -0.185786 -0.107106 -0.168370 0.100904 0.066538 0.091317 0.083695 0.109038 0.099013 0.112304 0.096542 0.105042 0.106036 0.092577 0.095563 0.124323 0.147151 0.133619 0.138755 0.136540 0.141687 0.146741 0.084802 0.107637 0.089145 0.093110 0.091133 0.154300 0.144727 0.158917 0.157917 0.155733
qa: 0.4425 -0.2172 -0.3354 -0.3327 -0.2519 -0.1470 -0.1694 -0.4385 -0.4376 -0.1109 -0.0854 -0.1034 -0.0079 -0.2706 -0.2709 0.3348 -0.1590 -0.1721 0.1642 -0.1942 0.2204 0.0414 -0.2593 0.3096 -0.1694 -0.2834 -0.1858 -0.1071 -0.1684 0.1009 0.0665 0.0913 0.0837 0.1090 0.0990 0.1123 0.0965 0.1050 0.1060 0.0926 0.0956 0.1243 0.1472 0.1336 0.1388 0.1365 0.1417 0.1467 0.0848 0.1076 0.0891 0.0931 0.0911 0.1543 0.1447 0.1589 0.1579 0.1557
va: 4.1695 1.0700 2.0773 2.0829 3.8193 3.9072 3.6564 3.9192 3.9059 3.8214 3.8133 3.7755 3.6842 4.0069 3.9011 3.7938 3.8268 3.8829 3.7053 3.9015 4.0352 3.8711 3.9128 3.6347 3.8287 3.9533 3.8743 3.8440 3.8663 1.0085 1.0248 1.0008 1.0018 1.0062 1.0069 1.0085 1.0111 1.0109 1.0098 1.0152 1.0107 0.9796 0.9847 1.0169 1.0068 0.9989 1.0003 0.9990 0.9948 0.9922 1.0055 1.0092 1.0031 0.9984 1.0096 0.9922 0.9883 0.9909
dispcorr: -0.035556868 hartree
energy: -1510.102200473373
dipole: -21.02311 19.60975 -1.41336 21.24993 -20.70292 0.54701 7.27017 -6.38757 0.88260
magnitude: 1.75379 au
magnitude: 4.45778 debye
