program: Orca
programVersion: 5.0.2
elementType: Si F O O C C C C C C C C C C C C C C C C C C C C C C C C C H H H H H H H H H H H H H H H H H H H H H H H H H H H H H
charge: 0
multiplicity: 1
keywords: wb97x-d3
keywords: def2-TZVPP
keywords: def2/J RIJCOSX
keywords: DEFGRID2
keywords: scfconv7
keywords: smallprint printgap noloewdin
keywords: NOSOSCF
formula: C25H29FO2Si
InChI: InChI=1/C25H29FO2Si/c1-4-27-21-13-15-23(16-14-21)29(2,3)18-8-9-20-12-17-24(26)25(19-20)28-22-10-6-5-7-11-22/h5-7,10-17,19H,4,8-9,18H2,1-3H3
58 atoms
Si -1.180783 0.609409 1.998532
F  -0.170421 -6.020902 -1.352667
O  -0.97325 6.577787 1.012042
O  1.631655 -4.132552 -1.908895
C  -2.002466 -0.245394 0.524334
C  -1.410483 0.148734 -0.827187
C  -1.079413 2.467138 1.709478
C  0.566269 -0.074427 2.175869
C  -2.19028 0.272696 3.550637
C  -1.900863 -0.712165 -1.997061
C  -2.101813 3.335273 2.111388
C  0.008813 3.044749 1.056273
C  -1.468647 -2.146032 -1.869055
C  -2.045479 4.695851 1.871226
C  0.089241 4.409356 0.802336
C  -0.946303 5.246892 1.209058
C  -0.117158 -2.466292 -1.97565
C  -2.374802 -3.165412 -1.597128
C  0.325258 -3.765976 -1.790753
C  -1.947322 -4.476906 -1.432735
C  -0.603033 -4.762972 -1.52131
C  0.11313 7.201187 0.339205
C  -0.188407 8.675404 0.232922
C  2.608062 -3.362048 -1.336449
C  2.424503 -2.688584 -0.134572
C  3.83006 -3.317477 -1.992984
C  3.476577 -1.956823 0.397758
C  4.875859 -2.591679 -1.44155
C  4.703256 -1.901158 -0.249883
H  -1.90205 -1.325544 0.685038
H  -3.079163 -0.043508 0.529514
H  -0.316791 0.099731 -0.796605
H  -1.653763 1.192972 -1.040295
H  1.155144 0.073435 1.268293
H  1.109158 0.397902 2.997292
H  0.539934 -1.148195 2.375734
H  -2.239739 -0.798458 3.759746
H  -1.760626 0.756857 4.430056
H  -3.219053 0.625764 3.452437
H  -2.990654 -0.658826 -2.059838
H  -1.512749 -0.294226 -2.930302
H  -2.971635 2.948307 2.630929
H  0.837156 2.426569 0.727887
H  -2.851176 5.344051 2.195178
H  0.96128 4.795935 0.292034
H  0.603606 -1.687575 -2.199026
H  -3.430131 -2.939189 -1.510382
H  -2.653271 -5.270076 -1.2218
H  0.242288 6.766743 -0.657845
H  1.044216 7.040756 0.893241
H  0.63308 9.176093 -0.279785
H  -1.098595 8.858578 -0.339131
H  -0.297206 9.135519 1.215664
H  1.478146 -2.729503 0.390173
H  3.960061 -3.850764 -2.926447
H  3.331525 -1.430676 1.332906
H  5.827684 -2.560306 -1.956014
H  5.517978 -1.327931 0.172476
elementType: Si F O C H
totalener: -1510.07130188 hartree
nucrepener: 2768.27449379 hartree
electener: -4278.34579567 hartree
oneelecener: -7566.30428537 hartree
twoeener: 3287.95848969 hartree
cpcmener: -0.02369883 hartree
kineticenergy: 1503.90561941 hartree
xcener: -135.228427699619 hartree
chargesum: 0.0000000
charge: 0.492082 -0.217708 -0.325325 -0.330316 -0.235920 -0.141613 -0.171355 -0.430206 -0.458898 -0.091959 -0.092514 -0.149695 0.004531 -0.288810 -0.253869 0.342709 -0.201780 -0.197466 0.196523 -0.157217 0.182538 0.063367 -0.272860 0.289608 -0.191575 -0.249792 -0.149491 -0.119079 -0.195514 0.080206 0.085293 0.078952 0.088405 0.084841 0.118191 0.111299 0.104084 0.105333 0.099450 0.081261 0.099057 0.135536 0.142868 0.133193 0.135930 0.145872 0.140368 0.148229 0.092369 0.093034 0.088684 0.086739 0.087357 0.156985 0.145128 0.168144 0.157113 0.157680
qa: 0.4921 -0.2177 -0.3253 -0.3303 -0.2359 -0.1416 -0.1714 -0.4302 -0.4589 -0.0920 -0.0925 -0.1497 0.0045 -0.2888 -0.2539 0.3427 -0.2018 -0.1975 0.1965 -0.1572 0.1825 0.0634 -0.2729 0.2896 -0.1916 -0.2498 -0.1495 -0.1191 -0.1955 0.0802 0.0853 0.0790 0.0884 0.0848 0.1182 0.1113 0.1041 0.1053 0.0995 0.0813 0.0991 0.1355 0.1429 0.1332 0.1359 0.1459 0.1404 0.1482 0.0924 0.0930 0.0887 0.0867 0.0874 0.1570 0.1451 0.1681 0.1571 0.1577
va: 4.1408 1.0685 2.0823 2.0823 3.7939 3.8847 3.7541 3.8995 3.9239 3.8592 3.8667 3.8954 3.6549 4.0432 3.9165 3.7559 3.9001 3.8693 3.6862 3.8727 4.0667 3.7996 3.9750 3.7258 3.8881 4.0008 3.8787 3.8912 3.9392 1.0155 1.0149 1.0016 1.0089 1.0075 1.0073 1.0036 1.0105 1.0101 1.0121 1.0110 1.0051 0.9896 0.9855 1.0148 1.0137 1.0036 1.0039 0.9976 0.9863 0.9864 1.0056 1.0038 1.0036 0.9956 1.0082 0.9859 0.9886 0.9915
dispcorr: -0.028657644 hartree
energy: -1510.099959524365
dipole: -4.27988 4.49109 0.21121 37.20195 -35.53657 1.66539 11.76371 -11.92054 -0.15683
magnitude: 1.68604 au
magnitude: 4.28556 debye
