program: Orca
programVersion: 5.0.2
elementType: Si F O O C C C C C C C C C C C C C C C C C C C C C C C C C H H H H H H H H H H H H H H H H H H H H H H H H H H H H H
charge: 0
multiplicity: 1
keywords: wb97x-d3
keywords: def2-TZVPP
keywords: def2/J RIJCOSX
keywords: DEFGRID2
keywords: scfconv7
keywords: smallprint printgap noloewdin
keywords: NOSOSCF
formula: C25H29FO2Si
InChI: InChI=1/C25H29FO2Si/c1-4-27-21-13-15-23(16-14-21)29(2,3)18-8-9-20-12-17-24(26)25(19-20)28-22-10-6-5-7-11-22/h5-7,10-17,19H,4,8-9,18H2,1-3H3
58 atoms
Si -1.616388 1.494733 0.174609
F  -1.278462 -5.282679 -2.989115
O  0.192548 5.251458 4.55845
O  0.996433 -3.89121 -2.940076
C  -1.53257 -0.291769 0.787692
C  -0.14382 -0.74414 1.231611
C  -1.024848 2.681314 1.509911
C  -3.400733 1.902491 -0.263323
C  -0.514726 1.662257 -1.345085
C  -0.058341 -2.237287 1.572786
C  0.324528 2.991534 1.672826
C  -1.918978 3.274901 2.409387
C  -0.374975 -3.106866 0.388546
C  0.778896 3.843198 2.673634
C  -1.49282 4.125804 3.411993
C  -0.134624 4.416159 3.555391
C  0.488237 -3.117418 -0.70467
C  -1.540223 -3.863157 0.32479
C  0.182439 -3.834803 -1.849969
C  -1.844593 -4.610978 -0.805555
C  -0.989337 -4.580243 -1.884095
C  1.5612 5.560866 4.785187
C  1.640245 6.468116 5.987462
C  1.629366 -2.759583 -3.381685
C  1.044573 -1.499611 -3.326364
C  2.88531 -2.931835 -3.94661
C  1.737857 -0.40943 -3.83301
C  3.559758 -1.834129 -4.461239
C  2.994472 -0.568017 -4.401605
H  -2.247697 -0.430084 1.606573
H  -1.894406 -0.925346 -0.030997
H  0.166924 -0.17192 2.110267
H  0.594959 -0.522447 0.454455
H  -4.073059 1.763666 0.585991
H  -3.513093 2.933314 -0.605612
H  -3.762366 1.252872 -1.063988
H  0.52045 1.381773 -1.141129
H  -0.875603 1.016346 -2.149258
H  -0.506021 2.684848 -1.728235
H  0.94836 -2.460564 1.937321
H  -0.745559 -2.46562 2.3911
H  1.064214 2.567131 1.002666
H  -2.982174 3.076561 2.330741
H  1.838918 4.046514 2.746719
H  -2.207426 4.572489 4.093237
H  1.408786 -2.545923 -0.6654
H  -2.225026 -3.87174 1.163497
H  -2.75086 -5.201127 -0.85494
H  1.989854 6.053748 3.905989
H  2.13274 4.643582 4.962832
H  1.09742 7.399776 5.824094
H  1.241653 5.985205 6.880382
H  2.682757 6.720062 6.1825
H  0.060311 -1.358442 -2.897322
H  3.328427 -3.919152 -3.984733
H  1.283017 0.572067 -3.786162
H  4.538379 -1.97251 -4.902628
H  3.526762 0.287545 -4.795909
elementType: Si F O C H
totalener: -1510.07142828 hartree
nucrepener: 2754.87510203 hartree
electener: -4264.94653032 hartree
oneelecener: -7539.48839670 hartree
twoeener: 3274.54186638 hartree
cpcmener: -0.02377680 hartree
kineticenergy: 1503.90624527 hartree
xcener: -135.228579095346 hartree
chargesum: 0.0000000
charge: 0.498790 -0.217999 -0.324897 -0.329554 -0.240009 -0.135790 -0.164760 -0.459418 -0.437376 -0.099632 -0.165415 -0.091788 -0.001288 -0.245703 -0.294968 0.343045 -0.204052 -0.192245 0.203899 -0.158388 0.181431 0.063734 -0.272776 0.293464 -0.192084 -0.250922 -0.145723 -0.119091 -0.196583 0.084075 0.081409 0.088413 0.078701 0.099461 0.105803 0.104177 0.098843 0.106383 0.117242 0.099792 0.081591 0.141707 0.136875 0.136219 0.133060 0.146076 0.139931 0.147634 0.092352 0.092456 0.086893 0.086893 0.088742 0.155627 0.145509 0.165573 0.157432 0.157226
qa: 0.4988 -0.2180 -0.3249 -0.3296 -0.2400 -0.1358 -0.1648 -0.4594 -0.4374 -0.0996 -0.1654 -0.0918 -0.0013 -0.2457 -0.2950 0.3430 -0.2041 -0.1922 0.2039 -0.1584 0.1814 0.0637 -0.2728 0.2935 -0.1921 -0.2509 -0.1457 -0.1191 -0.1966 0.0841 0.0814 0.0884 0.0787 0.0995 0.1058 0.1042 0.0988 0.1064 0.1172 0.0998 0.0816 0.1417 0.1369 0.1362 0.1331 0.1461 0.1399 0.1476 0.0924 0.0925 0.0869 0.0869 0.0887 0.1556 0.1455 0.1656 0.1574 0.1572
va: 4.1477 1.0677 2.0820 2.0837 3.8036 3.8748 3.7710 3.9264 3.8970 3.8606 3.8974 3.8710 3.6558 3.9022 4.0471 3.7575 3.8949 3.8699 3.6854 3.8766 4.0623 3.8005 3.9751 3.7248 3.8876 4.0028 3.8800 3.8895 3.9447 1.0165 1.0142 1.0102 1.0028 1.0114 1.0098 1.0105 1.0061 1.0041 1.0076 1.0054 1.0109 0.9894 0.9891 1.0134 1.0150 1.0030 1.0040 0.9978 0.9860 0.9866 1.0035 1.0036 1.0058 0.9977 1.0080 0.9864 0.9886 0.9917
dispcorr: -0.028492012 hartree
energy: -1510.099920294383
dipole: 2.13295 -1.22543 0.90751 33.94164 -32.75356 1.18808 21.46455 -20.39428 1.07027
magnitude: 1.83864 au
magnitude: 4.67346 debye
