program: Orca
programVersion: 5.0.2
elementType: Si F O O C C C C C C C C C C C C C C C C C C C C C C C C C H H H H H H H H H H H H H H H H H H H H H H H H H H H H H
charge: 0
multiplicity: 1
keywords: wb97x-d3
keywords: def2-TZVPP
keywords: def2/J RIJCOSX
keywords: DEFGRID2
keywords: scfconv7
keywords: smallprint printgap noloewdin
keywords: NOSOSCF
formula: C25H29FO2Si
InChI: InChI=1/C25H29FO2Si/c1-4-27-21-13-15-23(16-14-21)29(2,3)18-8-9-20-12-17-24(26)25(19-20)28-22-10-6-5-7-11-22/h5-7,10-17,19H,4,8-9,18H2,1-3H3
58 atoms
Si -3.644688 0.133799 1.429975
F  3.10056 -0.6551 -0.789394
O  0.843365 3.887527 2.986467
O  1.531713 -2.858298 -1.241793
C  -3.165113 -0.57639 -0.252759
C  -3.05682 0.471931 -1.361265
C  -2.282841 1.33818 1.927665
C  -3.736457 -1.26272 2.691519
C  -5.292636 1.039717 1.355395
C  -2.19374 0.032163 -2.552035
C  -0.933429 1.016111 1.727248
C  -2.549463 2.576058 2.507649
C  -0.756251 -0.158178 -2.15585
C  0.08642 1.876638 2.085636
C  -1.540992 3.458888 2.881891
C  -0.209924 3.110853 2.669696
C  -0.223365 -1.430168 -1.966959
C  0.054171 0.944177 -1.89511
C  1.072973 -1.600924 -1.507188
C  1.35698 0.789033 -1.444334
C  1.850931 -0.482689 -1.244664
C  0.614473 5.156548 3.584415
C  1.9538 5.810852 3.817163
C  2.596204 -3.360051 -1.937542
C  3.031995 -2.841632 -3.149504
C  3.219204 -4.468387 -1.376423
C  4.110805 -3.43792 -3.790172
C  4.289559 -5.054562 -2.031688
C  4.746249 -4.540167 -3.238718
H  -2.205105 -1.086338 -0.11182
H  -3.867003 -1.364077 -0.54611
H  -2.643532 1.408157 -0.97062
H  -4.057175 0.719349 -1.726324
H  -2.784702 -1.793609 2.767483
H  -3.97829 -0.887818 3.688467
H  -4.499017 -1.998239 2.42448
H  -6.085115 0.367284 1.018007
H  -5.592941 1.419463 2.334125
H  -5.271858 1.886527 0.666368
H  -2.590708 -0.894783 -2.973292
H  -2.260475 0.789498 -3.337505
H  -0.65943 0.067884 1.276498
H  -3.574682 2.883013 2.682403
H  1.121143 1.60246 1.916254
H  -1.812867 4.405393 3.329738
H  -0.825594 -2.309901 -2.162024
H  -0.33627 1.944749 -2.035997
H  1.98061 1.648902 -1.235137
H  0.07793 5.038429 4.532018
H  -0.003994 5.778936 2.928842
H  2.495001 5.960879 2.882317
H  1.803615 6.788714 4.275001
H  2.577941 5.221158 4.489483
H  2.542117 -1.990296 -3.605457
H  2.863261 -4.864864 -0.433607
H  4.451173 -3.030965 -4.73375
H  4.773022 -5.916886 -1.590842
H  5.586064 -4.996536 -3.745512
elementType: Si F O C H
totalener: -1510.07160242 hartree
nucrepener: 2813.18210532 hartree
electener: -4323.25370774 hartree
oneelecener: -7657.02898501 hartree
twoeener: 3333.77527727 hartree
cpcmener: -0.02336232 hartree
kineticenergy: 1503.89974236 hartree
xcener: -135.226901189007 hartree
chargesum: 0.0000000
charge: 0.475204 -0.218455 -0.325188 -0.325677 -0.269824 -0.146013 -0.190592 -0.413978 -0.448644 -0.083068 -0.095567 -0.124358 0.042495 -0.292850 -0.262746 0.358494 -0.240957 -0.195211 0.177694 -0.216109 0.277360 0.063657 -0.272971 0.294350 -0.182059 -0.252248 -0.160447 -0.119914 -0.189308 0.080429 0.094364 0.080011 0.090199 0.100637 0.100459 0.101034 0.109538 0.105147 0.108437 0.082325 0.097600 0.139079 0.138915 0.132557 0.136368 0.135446 0.143081 0.149375 0.092782 0.091308 0.086841 0.088544 0.087438 0.151002 0.143319 0.157911 0.156123 0.156660
qa: 0.4752 -0.2185 -0.3252 -0.3257 -0.2698 -0.1460 -0.1906 -0.4140 -0.4486 -0.0831 -0.0956 -0.1244 0.0425 -0.2928 -0.2627 0.3585 -0.2410 -0.1952 0.1777 -0.2161 0.2774 0.0637 -0.2730 0.2943 -0.1821 -0.2522 -0.1604 -0.1199 -0.1893 0.0804 0.0944 0.0800 0.0902 0.1006 0.1005 0.1010 0.1095 0.1051 0.1084 0.0823 0.0976 0.1391 0.1389 0.1326 0.1364 0.1354 0.1431 0.1494 0.0928 0.0913 0.0868 0.0885 0.0874 0.1510 0.1433 0.1579 0.1561 0.1567
va: 4.1388 1.0666 2.0826 2.0716 3.8409 3.8927 3.7560 3.8914 3.9111 3.8401 3.8082 3.8755 3.5882 4.0249 3.9043 3.7522 3.9473 3.8507 3.7211 3.8866 3.9500 3.8007 3.9748 3.6830 3.8751 3.9930 3.9124 3.8962 3.9028 1.0145 1.0150 1.0025 1.0081 1.0089 1.0096 1.0089 1.0085 1.0087 1.0054 1.0093 1.0056 0.9796 0.9899 1.0153 1.0134 1.0162 1.0024 0.9994 0.9862 0.9861 1.0036 1.0059 1.0034 1.0039 1.0101 0.9910 0.9895 0.9909
dispcorr: -0.029161183 hartree
energy: -1510.100763607243
dipole: -24.52091 23.48845 -1.03246 16.01407 -14.78651 1.22756 11.34245 -11.64435 -0.30190
magnitude: 1.63218 au
magnitude: 4.14868 debye
