program: Orca
programVersion: 5.0.2
elementType: Si F O O C C C C C C C C C C C C C C C C C C C C C C C C C H H H H H H H H H H H H H H H H H H H H H H H H H H H H H
charge: 0
multiplicity: 1
keywords: wb97x-d3
keywords: def2-TZVPP
keywords: def2/J RIJCOSX
keywords: DEFGRID2
keywords: scfconv7
keywords: smallprint printgap noloewdin
keywords: NOSOSCF
formula: C25H29FO2Si
InChI: InChI=1/C25H29FO2Si/c1-4-27-21-13-15-23(16-14-21)29(2,3)18-8-9-20-12-17-24(26)25(19-20)28-22-10-6-5-7-11-22/h5-7,10-17,19H,4,8-9,18H2,1-3H3
58 atoms
Si -3.820458 -0.139303 1.398594
F  2.647704 0.142394 -0.34567
O  1.296412 2.985057 2.193053
O  1.50057 -2.31581 -0.755954
C  -3.611877 -0.899536 -0.317709
C  -3.551697 0.147309 -1.439811
C  -2.272599 0.885667 1.711755
C  -3.93593 -1.497261 2.696643
C  -5.344062 0.961914 1.457577
C  -2.522132 -0.167521 -2.532702
C  -1.0471 0.257459 1.971855
C  -2.25819 2.275863 1.63216
C  -1.114513 -0.09186 -2.010003
C  0.121232 0.97396 2.142633
C  -1.093154 3.020242 1.792568
C  0.109433 2.367218 2.043874
C  -0.397164 -1.2436 -1.701277
C  -0.518144 1.144132 -1.765802
C  0.868263 -1.168631 -1.139738
C  0.753158 1.233819 -1.220324
C  1.430015 0.075921 -0.902195
C  1.354879 4.400676 2.087147
C  2.789146 4.825517 2.279951
C  2.691503 -2.667937 -1.326028
C  3.145974 -2.150307 -2.531266
C  3.432811 -3.624465 -0.642573
C  4.36023 -2.592245 -3.04094
C  4.637962 -4.059699 -1.1689
C  5.112472 -3.542956 -2.367836
H  -2.684143 -1.481291 -0.278553
H  -4.399902 -1.630237 -0.522575
H  -3.320143 1.144011 -1.048049
H  -4.537331 0.241441 -1.901339
H  -4.005192 -1.083746 3.705029
H  -4.816388 -2.124568 2.539379
H  -3.064846 -2.155845 2.674699
H  -5.324144 1.740673 0.692342
H  -6.248676 0.372707 1.289762
H  -5.455902 1.454813 2.425454
H  -2.715604 -1.160225 -2.946383
H  -2.644905 0.545395 -3.352192
H  -0.993126 -0.823905 2.042329
H  -3.176478 2.818676 1.437698
H  1.055466 0.462062 2.34048
H  -1.146757 4.097872 1.714592
H  -0.827062 -2.221555 -1.884433
H  -1.053524 2.056316 -1.999726
H  1.211128 2.195232 -1.025509
H  0.71501 4.864634 2.845338
H  0.991098 4.722227 1.105258
H  3.44015 4.39867 1.516355
H  2.857026 5.91098 2.206153
H  3.166346 4.534752 3.260794
H  2.569066 -1.418229 -3.082134
H  3.063584 -4.022604 0.29427
H  4.714629 -2.185413 -3.979124
H  5.211824 -4.804147 -0.632253
H  6.056873 -3.88025 -2.773422
elementType: Si F O C H
totalener: -1510.06970430 hartree
nucrepener: 2937.90663356 hartree
electener: -4447.97633786 hartree
oneelecener: -7907.01376833 hartree
twoeener: 3459.03743047 hartree
cpcmener: -0.02450175 hartree
kineticenergy: 1503.92233136 hartree
xcener: -135.233481502295 hartree
chargesum: 0.0000000
charge: 0.483991 -0.222369 -0.326510 -0.327192 -0.272772 -0.126503 -0.140211 -0.443776 -0.430564 -0.098169 -0.136213 -0.153499 0.085547 -0.274102 -0.233034 0.337349 -0.261857 -0.248576 0.208110 -0.150366 0.239200 0.057160 -0.273164 0.304066 -0.190187 -0.263331 -0.155269 -0.116754 -0.192531 0.082436 0.096091 0.064199 0.092456 0.103463 0.101906 0.100008 0.100804 0.107967 0.109183 0.087313 0.096316 0.133877 0.142727 0.129230 0.135313 0.135210 0.140704 0.145859 0.098150 0.091042 0.087537 0.088462 0.087322 0.150270 0.142448 0.157901 0.156825 0.156506
qa: 0.4840 -0.2224 -0.3265 -0.3272 -0.2728 -0.1265 -0.1402 -0.4438 -0.4306 -0.0982 -0.1362 -0.1535 0.0855 -0.2741 -0.2330 0.3373 -0.2619 -0.2486 0.2081 -0.1504 0.2392 0.0572 -0.2732 0.3041 -0.1902 -0.2633 -0.1553 -0.1168 -0.1925 0.0824 0.0961 0.0642 0.0925 0.1035 0.1019 0.1000 0.1008 0.1080 0.1092 0.0873 0.0963 0.1339 0.1427 0.1292 0.1353 0.1352 0.1407 0.1459 0.0982 0.0910 0.0875 0.0885 0.0873 0.1503 0.1424 0.1579 0.1568 0.1565
va: 4.1398 1.0578 2.0645 2.0654 3.8280 3.8967 3.7005 3.9043 3.9098 3.8473 3.8603 3.8969 3.5545 3.9682 3.8738 3.7307 3.9800 3.8969 3.6762 3.8274 3.9557 3.7980 3.9760 3.6787 3.8804 4.0015 3.9065 3.8917 3.9068 1.0142 1.0112 1.0065 1.0092 1.0088 1.0109 1.0113 1.0082 1.0093 1.0076 1.0075 1.0055 0.9915 0.9884 1.0177 1.0126 1.0163 1.0042 0.9986 0.9875 0.9851 1.0032 1.0059 1.0036 1.0048 1.0112 0.9909 0.9893 0.9910
dispcorr: -0.032515110 hartree
energy: -1510.102219407418
dipole: -22.48842 21.59986 -0.88855 11.12984 -9.98538 1.14446 5.81470 -6.58848 -0.77378
magnitude: 1.64258 au
magnitude: 4.17510 debye
