program: Orca
programVersion: 5.0.2
elementType: Si F O O C C C C C C C C C C C C C C C C C C C C C C C C C H H H H H H H H H H H H H H H H H H H H H H H H H H H H H
charge: 0
multiplicity: 1
keywords: wb97x-d3
keywords: def2-TZVPP
keywords: def2/J RIJCOSX
keywords: DEFGRID2
keywords: scfconv7
keywords: smallprint printgap noloewdin
keywords: NOSOSCF
formula: C25H29FO2Si
InChI: InChI=1/C25H29FO2Si/c1-4-27-21-13-15-23(16-14-21)29(2,3)18-8-9-20-12-17-24(26)25(19-20)28-22-10-6-5-7-11-22/h5-7,10-17,19H,4,8-9,18H2,1-3H3
58 atoms
Si -3.794773 1.331872 0.129679
F  1.426147 -3.488763 -2.316793
O  1.948635 2.514687 1.621575
O  1.232852 -0.864297 -1.620217
C  -3.896281 -0.416953 -0.605878
C  -3.960694 -1.590486 0.373617
C  -2.02927 1.801414 0.589184
C  -4.876999 1.432653 1.666159
C  -4.407548 2.531707 -1.187521
C  -2.676549 -1.865049 1.164613
C  -1.551952 1.704795 1.901332
C  -1.105331 2.182494 -0.383769
C  -1.542162 -2.309457 0.284937
C  -0.229282 1.950003 2.221271
C  0.231091 2.430662 -0.089602
C  0.68021 2.308628 1.224227
C  -0.609143 -1.396056 -0.197664
C  -1.431024 -3.639755 -0.112182
C  0.382283 -1.788299 -1.079419
C  -0.430511 -4.05108 -0.981138
C  0.463787 -3.118311 -1.461948
C  2.942356 2.797479 0.644028
C  4.271875 2.914477 1.346501
C  2.504759 -0.758981 -1.132843
C  2.892308 -1.261265 0.102345
C  3.412703 -0.076667 -1.935204
C  4.20377 -1.080126 0.525162
C  4.716372 0.094906 -1.498089
C  5.121206 -0.406294 -0.266908
H  -4.808551 -0.43064 -1.213892
H  -3.080272 -0.556173 -1.323528
H  -4.225421 -2.503577 -0.17011
H  -4.773006 -1.427763 1.087678
H  -5.912652 1.174991 1.432508
H  -4.547059 0.75229 2.454076
H  -4.881687 2.439923 2.088208
H  -4.338723 3.569822 -0.856258
H  -3.834271 2.44602 -2.113535
H  -5.452176 2.337077 -1.441298
H  -2.383321 -0.97663 1.728878
H  -2.886409 -2.643105 1.902635
H  -2.223476 1.422214 2.704465
H  -1.415009 2.279918 -1.418973
H  0.112793 1.861556 3.245649
H  0.900426 2.711997 -0.891642
H  -0.657953 -0.356579 0.100244
H  -2.137373 -4.372995 0.258059
H  -0.348013 -5.08628 -1.287119
H  2.705378 3.730437 0.121286
H  2.974166 1.997643 -0.102739
H  5.051978 3.114002 0.61165
H  4.275323 3.734137 2.066238
H  4.532894 1.993276 1.868177
H  2.191767 -1.785082 0.740206
H  3.096189 0.31366 -2.894553
H  4.503742 -1.473392 1.488114
H  5.42077 0.623315 -2.12768
H  6.140408 -0.271773 0.070555
elementType: Si F O C H
totalener: -1510.06997340 hartree
nucrepener: 2996.26814820 hartree
electener: -4506.33812160 hartree
oneelecener: -8023.05163298 hartree
twoeener: 3516.71351138 hartree
cpcmener: -0.02164341 hartree
kineticenergy: 1503.91049596 hartree
xcener: -135.233785178689 hartree
chargesum: 0.0000000
charge: 0.493616 -0.217483 -0.326517 -0.320683 -0.273746 -0.161512 -0.125646 -0.436974 -0.460337 -0.112629 -0.116172 -0.149807 -0.008482 -0.269778 -0.262316 0.342803 -0.129500 -0.149230 0.117654 -0.212086 0.294918 0.077762 -0.291739 0.250475 -0.145865 -0.207921 -0.169391 -0.125986 -0.193818 0.099648 0.083010 0.092805 0.085849 0.111758 0.099331 0.114319 0.102574 0.100656 0.103541 0.094847 0.097986 0.145236 0.130987 0.132163 0.136513 0.069858 0.142921 0.146592 0.112172 0.048941 0.094277 0.100951 0.086620 0.150135 0.138810 0.156754 0.153771 0.157366
qa: 0.4936 -0.2175 -0.3265 -0.3207 -0.2737 -0.1615 -0.1256 -0.4370 -0.4603 -0.1126 -0.1162 -0.1498 -0.0085 -0.2698 -0.2623 0.3428 -0.1295 -0.1492 0.1177 -0.2121 0.2949 0.0778 -0.2917 0.2505 -0.1459 -0.2079 -0.1694 -0.1260 -0.1938 0.0996 0.0830 0.0928 0.0858 0.1118 0.0993 0.1143 0.1026 0.1007 0.1035 0.0948 0.0980 0.1452 0.1310 0.1322 0.1365 0.0699 0.1429 0.1466 0.1122 0.0489 0.0943 0.1010 0.0866 0.1501 0.1388 0.1568 0.1538 0.1574
va: 4.1116 1.0711 2.0710 2.0574 3.8193 3.9123 3.6495 3.9021 3.9116 3.8101 3.8325 3.8753 3.6727 4.0478 3.8390 3.7269 3.7810 3.8715 3.7949 3.9460 3.9886 3.7705 3.9675 3.6462 3.8132 3.9112 3.8972 3.8633 3.8503 1.0064 1.0141 1.0018 1.0016 1.0066 1.0067 1.0090 1.0108 1.0114 1.0104 1.0126 1.0101 0.9854 0.9965 1.0147 1.0125 1.0350 0.9991 0.9998 0.9948 0.9966 1.0047 1.0067 1.0035 1.0037 1.0120 0.9917 0.9913 0.9912
dispcorr: -0.035028624 hartree
energy: -1510.105002027068
dipole: -15.56950 15.28874 -0.28076 17.34950 -17.35766 -0.00815 10.97276 -10.59784 0.37492
magnitude: 0.46846 au
magnitude: 1.19073 debye
