program: Orca
programVersion: 5.0.2
elementType: Si F O O C C C C C C C C C C C C C C C C C C C C C C C C C H H H H H H H H H H H H H H H H H H H H H H H H H H H H H
charge: 0
multiplicity: 1
keywords: wb97x-d3
keywords: def2-TZVPP
keywords: def2/J RIJCOSX
keywords: DEFGRID2
keywords: scfconv7
keywords: smallprint printgap noloewdin
keywords: NOSOSCF
formula: C25H29FO2Si
InChI: InChI=1/C25H29FO2Si/c1-4-27-21-13-15-23(16-14-21)29(2,3)18-8-9-20-12-17-24(26)25(19-20)28-22-10-6-5-7-11-22/h5-7,10-17,19H,4,8-9,18H2,1-3H3
58 atoms
Si -3.588321 0.774679 0.196137
F  3.39101 -1.128902 0.64081
O  0.595977 1.50386 4.502943
O  2.119663 -2.306997 -1.392125
C  -2.794381 -0.125278 -1.271327
C  -2.070088 0.741809 -2.302308
C  -2.318782 1.058871 1.556766
C  -4.950801 -0.333621 0.881343
C  -4.32388 2.423223 -0.337617
C  -0.9134 1.583924 -1.768724
C  -1.971935 2.326401 2.016291
C  -1.654029 -0.026374 2.142467
C  0.215007 0.831865 -1.110941
C  -1.007231 2.52618 2.999453
C  -0.694383 0.144285 3.12112
C  -0.35662 1.428757 3.555345
C  0.628178 -0.413646 -1.574933
C  0.898689 1.397923 -0.037675
C  1.702774 -1.072011 -0.993861
C  1.96316 0.743336 0.563438
C  2.360879 -0.482514 0.075154
C  1.007105 2.779344 4.975127
C  2.075797 2.565814 6.018467
C  2.212167 -2.584758 -2.730279
C  1.831621 -3.854923 -3.138519
C  2.706808 -1.663248 -3.645509
C  1.949801 -4.205646 -4.476002
C  2.808674 -2.024819 -4.980964
C  2.431202 -3.292379 -5.403732
H  -2.124566 -0.899919 -0.881338
H  -3.593058 -0.675075 -1.781887
H  -2.785849 1.4281 -2.763392
H  -1.7129 0.111483 -3.122701
H  -5.736218 -0.504615 0.14146
H  -4.566582 -1.313192 1.175268
H  -5.422102 0.107069 1.762629
H  -3.573507 3.117574 -0.720744
H  -5.064148 2.279663 -1.128149
H  -4.835524 2.919626 0.490288
H  -0.501673 2.160587 -2.603954
H  -1.290634 2.329383 -1.063302
H  -2.452448 3.205156 1.600956
H  -1.880116 -1.039497 1.826039
H  -0.778828 3.536836 3.310806
H  -0.191469 -0.712565 3.553829
H  0.113756 -0.885084 -2.404156
H  0.590898 2.361876 0.346931
H  2.484478 1.183888 1.40402
H  0.156521 3.318267 5.405953
H  1.395655 3.382434 4.147209
H  1.701275 1.986654 6.863289
H  2.944755 2.053297 5.60418
H  2.408918 3.531573 6.398984
H  1.450119 -4.563063 -2.413449
H  3.012472 -0.67394 -3.328537
H  1.655355 -5.198102 -4.792252
H  3.190407 -1.306125 -5.694773
H  2.514482 -3.566216 -6.447249
elementType: Si F O C H
totalener: -1510.06911635 hartree
nucrepener: 2892.82278041 hartree
electener: -4402.89189677 hartree
oneelecener: -7816.31884696 hartree
twoeener: 3413.42695019 hartree
cpcmener: -0.02444937 hartree
kineticenergy: 1503.90189322 hartree
xcener: -135.232439544173 hartree
chargesum: 0.0000000
charge: 0.482638 -0.218022 -0.325926 -0.331817 -0.270036 -0.142568 -0.107972 -0.455082 -0.440611 -0.082524 -0.166661 -0.104631 0.059030 -0.242854 -0.314527 0.357799 -0.238998 -0.226758 0.197410 -0.179506 0.204735 0.059567 -0.274557 0.265197 -0.240806 -0.171472 -0.124254 -0.150177 -0.183145 0.082969 0.095922 0.090860 0.084281 0.101093 0.100004 0.100077 0.104204 0.113480 0.110854 0.098747 0.078931 0.142322 0.131036 0.134730 0.128887 0.152444 0.144455 0.144932 0.095591 0.093611 0.087707 0.087658 0.088244 0.146277 0.152997 0.157349 0.159173 0.157690
qa: 0.4826 -0.2180 -0.3259 -0.3318 -0.2700 -0.1426 -0.1080 -0.4551 -0.4406 -0.0825 -0.1667 -0.1046 0.0590 -0.2429 -0.3145 0.3578 -0.2390 -0.2268 0.1974 -0.1795 0.2047 0.0596 -0.2746 0.2652 -0.2408 -0.1715 -0.1243 -0.1502 -0.1831 0.0830 0.0959 0.0909 0.0843 0.1011 0.1000 0.1001 0.1042 0.1135 0.1109 0.0987 0.0789 0.1423 0.1310 0.1347 0.1289 0.1524 0.1445 0.1449 0.0956 0.0936 0.0877 0.0877 0.0882 0.1463 0.1530 0.1573 0.1592 0.1577
va: 4.0953 1.0703 2.0699 2.0742 3.8458 3.8954 3.6717 3.9009 3.9139 3.8195 3.8624 3.8338 3.6111 3.8588 4.0060 3.6873 3.8864 3.8803 3.6797 3.8450 4.0715 3.7968 3.9753 3.7160 3.9999 3.8881 3.8882 3.8944 3.9025 1.0128 1.0092 0.9990 1.0017 1.0112 1.0108 1.0100 1.0072 1.0088 1.0091 1.0022 1.0092 0.9901 0.9939 1.0132 1.0163 0.9962 0.9973 1.0005 0.9870 0.9854 1.0034 1.0031 1.0060 1.0076 0.9982 0.9892 0.9904 0.9906
dispcorr: -0.031603470 hartree
energy: -1510.100719824751
dipole: -24.68561 23.93553 -0.75008 16.86939 -15.29385 1.57555 3.90264 -4.59734 -0.69469
magnitude: 1.87818 au
magnitude: 4.77396 debye
