program: Orca
programVersion: 5.0.2
elementType: Si F O O C C C C C C C C C C C C C C C C C C C C C C C C C H H H H H H H H H H H H H H H H H H H H H H H H H H H H H
charge: 0
multiplicity: 1
keywords: wb97x-d3
keywords: def2-TZVPP
keywords: def2/J RIJCOSX
keywords: DEFGRID2
keywords: scfconv7
keywords: smallprint printgap noloewdin
keywords: NOSOSCF
formula: C25H29FO2Si
InChI: InChI=1/C25H29FO2Si/c1-4-27-21-13-15-23(16-14-21)29(2,3)18-8-9-20-12-17-24(26)25(19-20)28-22-10-6-5-7-11-22/h5-7,10-17,19H,4,8-9,18H2,1-3H3
58 atoms
Si -3.450839 1.479235 0.358859
F  1.122877 -3.555394 -3.04735
O  2.322028 3.294751 0.635154
O  1.61085 -1.677352 -1.240889
C  -3.492835 -0.39135 0.09524
C  -2.959754 -1.181989 1.289277
C  -1.651496 2.037491 0.426371
C  -4.292429 1.921433 1.983162
C  -4.306802 2.331967 -1.084211
C  -2.692783 -2.656743 0.988319
C  -0.931227 2.094965 1.626321
C  -0.962734 2.401473 -0.730258
C  -1.67729 -2.893199 -0.099877
C  0.389417 2.503568 1.671846
C  0.363549 2.818098 -0.711367
C  1.047858 2.881812 0.499994
C  -0.489248 -2.164711 -0.133181
C  -1.901636 -3.84361 -1.091058
C  0.459481 -2.391564 -1.117715
C  -0.964074 -4.07438 -2.088839
C  0.207936 -3.352321 -2.088831
C  3.02341 3.756111 -0.512196
C  4.389231 4.223121 -0.074574
C  2.342558 -1.313575 -0.144003
C  2.419021 -2.084803 1.009559
C  3.075608 -0.139976 -0.259483
C  3.222002 -1.655757 2.057313
C  3.888834 0.264065 0.788549
C  3.958466 -0.483854 1.955613
H  -4.511925 -0.716099 -0.141523
H  -2.898863 -0.603535 -0.800919
H  -3.677405 -1.127085 2.111994
H  -2.043417 -0.725215 1.676882
H  -5.335066 1.59465 1.98271
H  -3.810737 1.450987 2.842784
H  -4.289066 2.99923 2.15892
H  -4.238181 3.419594 -1.016011
H  -3.880496 2.035989 -2.045221
H  -5.36789 2.073247 -1.113579
H  -2.353082 -3.148047 1.906096
H  -3.629025 -3.148153 0.711744
H  -1.409687 1.826704 2.561779
H  -1.463054 2.373081 -1.692164
H  0.918159 2.544799 2.616773
H  0.838116 3.093807 -1.643571
H  -0.297598 -1.404399 0.614509
H  -2.822964 -4.412542 -1.093078
H  -1.142322 -4.812666 -2.860279
H  2.475993 4.580243 -0.982498
H  3.112553 2.954184 -1.252895
H  4.322193 5.036074 0.649405
H  4.973368 3.41482 0.366543
H  4.938129 4.593315 -0.940675
H  1.866961 -3.011303 1.101276
H  3.015224 0.444222 -1.169402
H  3.276308 -2.25454 2.957442
H  4.470843 1.170794 0.690515
H  4.585357 -0.159092 2.775572
elementType: Si F O C H
totalener: -1510.07022657 hartree
nucrepener: 2945.34542532 hartree
electener: -4455.41565190 hartree
oneelecener: -7921.40134831 hartree
twoeener: 3465.98569641 hartree
cpcmener: -0.02515335 hartree
kineticenergy: 1503.90336124 hartree
xcener: -135.230947780563 hartree
chargesum: -0.0000000
charge: 0.486212 -0.217668 -0.323271 -0.327398 -0.245339 -0.122583 -0.160252 -0.433293 -0.456858 -0.108775 -0.097773 -0.137261 0.006363 -0.286027 -0.243863 0.325013 -0.254924 -0.187893 0.273463 -0.162736 0.163120 0.014750 -0.266589 0.341332 -0.225360 -0.303583 -0.123439 -0.096383 -0.224476 0.087887 0.082693 0.090938 0.072663 0.107773 0.100184 0.111001 0.105153 0.100178 0.104668 0.094405 0.082275 0.141808 0.135566 0.130744 0.136541 0.143179 0.138174 0.147249 0.114020 0.102752 0.090856 0.083750 0.091553 0.155091 0.143597 0.158821 0.187063 0.154907
qa: 0.4862 -0.2177 -0.3233 -0.3274 -0.2453 -0.1226 -0.1603 -0.4333 -0.4569 -0.1088 -0.0978 -0.1373 0.0064 -0.2860 -0.2439 0.3250 -0.2549 -0.1879 0.2735 -0.1627 0.1631 0.0147 -0.2666 0.3413 -0.2254 -0.3036 -0.1234 -0.0964 -0.2245 0.0879 0.0827 0.0909 0.0727 0.1078 0.1002 0.1110 0.1052 0.1002 0.1047 0.0944 0.0823 0.1418 0.1356 0.1307 0.1365 0.1432 0.1382 0.1472 0.1140 0.1028 0.0909 0.0837 0.0916 0.1551 0.1436 0.1588 0.1871 0.1549
va: 4.1373 1.0681 2.0478 2.0828 3.8205 3.8845 3.7083 3.8956 3.9169 3.8607 3.8247 3.9122 3.6783 4.0439 3.8812 3.7241 3.9165 3.9014 3.6024 3.8762 4.0707 3.8035 3.9645 3.6820 3.9076 3.9697 3.8796 3.8152 3.9643 1.0126 1.0126 1.0051 1.0020 1.0072 1.0085 1.0083 1.0098 1.0109 1.0111 1.0006 1.0062 0.9862 0.9907 1.0160 1.0125 0.9959 1.0018 0.9985 0.9918 0.9793 1.0036 1.0061 1.0058 0.9971 1.0157 0.9894 0.9636 0.9941
dispcorr: -0.032183893 hartree
energy: -1510.102410464734
dipole: -14.43177 13.87697 -0.55480 21.85809 -21.52136 0.33673 12.78852 -12.26643 0.52209
magnitude: 0.83292 au
magnitude: 2.11713 debye
