program: Orca
programVersion: 5.0.2
elementType: Si F O O C C C C C C C C C C C C C C C C C C C C C C C C C H H H H H H H H H H H H H H H H H H H H H H H H H H H H H
charge: 0
multiplicity: 1
keywords: wb97x-d3
keywords: def2-TZVPP
keywords: def2/J RIJCOSX
keywords: DEFGRID2
keywords: scfconv7
keywords: smallprint printgap noloewdin
keywords: NOSOSCF
formula: C25H29FO2Si
InChI: InChI=1/C25H29FO2Si/c1-4-27-21-13-15-23(16-14-21)29(2,3)18-8-9-20-12-17-24(26)25(19-20)28-22-10-6-5-7-11-22/h5-7,10-17,19H,4,8-9,18H2,1-3H3
58 atoms
Si -3.82453 1.171904 0.287379
F  1.802252 -2.48116 1.857047
O  2.00365 1.900704 1.736418
O  2.130783 -0.813627 -0.176312
C  -3.886329 -0.552502 -0.475427
C  -3.066773 -0.657347 -1.768185
C  -2.027049 1.447323 0.775092
C  -4.910721 1.24064 1.822684
C  -4.361401 2.475321 -0.958364
C  -2.328256 -1.990862 -1.924444
C  -1.471508 0.740849 1.842098
C  -1.167342 2.292366 0.066065
C  -1.229028 -2.151869 -0.909578
C  -0.135148 0.860692 2.202228
C  0.168289 2.427344 0.402123
C  0.696506 1.711252 1.477046
C  -0.057283 -1.406752 -1.042112
C  -1.363826 -2.993441 0.188509
C  0.971516 -1.523091 -0.12147
C  -0.34977 -3.101325 1.132786
C  0.806516 -2.376168 0.962993
C  2.615367 1.17634 2.795925
C  4.081267 1.530055 2.815844
C  2.672355 -0.473511 -1.388684
C  3.166397 0.815306 -1.525302
C  2.78434 -1.391213 -2.426186
C  3.7749 1.189103 -2.71554
C  3.385212 -0.999703 -3.613609
C  3.881147 0.288746 -3.765718
H  -3.492574 -1.233951 0.287283
H  -4.916027 -0.878159 -0.650007
H  -2.321706 0.143432 -1.835149
H  -3.724513 -0.51201 -2.628112
H  -5.959284 1.058627 1.575799
H  -4.618746 0.489186 2.559524
H  -4.854641 2.215171 2.312275
H  -5.402697 2.319592 -1.250436
H  -4.290353 3.485137 -0.548699
H  -3.765888 2.450407 -1.873264
H  -3.038219 -2.81705 -1.836554
H  -1.902918 -2.048293 -2.929978
H  -2.087221 0.064757 2.426397
H  -1.54044 2.86709 -0.774276
H  0.235426 0.289074 3.042567
H  0.810964 3.09091 -0.164294
H  0.052938 -0.732192 -1.883498
H  -2.265622 -3.579431 0.313541
H  -0.452399 -3.757807 1.987581
H  2.487331 0.100029 2.647292
H  2.14565 1.436844 3.750467
H  4.571165 0.993586 3.628613
H  4.574174 1.245454 1.885324
H  4.235996 2.597039 2.980164
H  3.081864 1.51757 -0.70624
H  2.411171 -2.401769 -2.315543
H  4.160153 2.195251 -2.819782
H  3.470616 -1.713471 -4.422836
H  4.350143 0.586161 -4.694382
elementType: Si F O C H
totalener: -1510.07029894 hartree
nucrepener: 3042.99803746 hartree
electener: -4553.06833640 hartree
oneelecener: -8117.28553606 hartree
twoeener: 3564.21719966 hartree
cpcmener: -0.02200070 hartree
kineticenergy: 1503.91239051 hartree
xcener: -135.233382431118 hartree
chargesum: 0.0000000
charge: 0.476149 -0.222846 -0.324590 -0.320909 -0.262718 -0.123199 -0.115008 -0.440168 -0.429536 -0.102270 -0.213285 -0.103749 0.075035 -0.218559 -0.285077 0.337848 -0.250210 -0.228216 0.228187 -0.131507 0.153329 0.038665 -0.269601 0.311020 -0.261847 -0.194504 -0.131978 -0.144234 -0.182996 0.074486 0.094280 0.064296 0.093544 0.102434 0.099027 0.102765 0.108353 0.109344 0.100355 0.086496 0.096466 0.131003 0.141513 0.135431 0.135400 0.142390 0.143153 0.145220 0.086543 0.107975 0.091954 0.086615 0.088620 0.141205 0.153827 0.158198 0.158233 0.157648
qa: 0.4761 -0.2228 -0.3246 -0.3209 -0.2627 -0.1232 -0.1150 -0.4402 -0.4295 -0.1023 -0.2133 -0.1037 0.0750 -0.2186 -0.2851 0.3378 -0.2502 -0.2282 0.2282 -0.1315 0.1533 0.0387 -0.2696 0.3110 -0.2618 -0.1945 -0.1320 -0.1442 -0.1830 0.0745 0.0943 0.0643 0.0935 0.1024 0.0990 0.1028 0.1084 0.1093 0.1004 0.0865 0.0965 0.1310 0.1415 0.1354 0.1354 0.1424 0.1432 0.1452 0.0865 0.1080 0.0920 0.0866 0.0886 0.1412 0.1538 0.1582 0.1582 0.1576
va: 4.1416 1.0592 2.0631 2.0385 3.8321 3.8799 3.6812 3.9025 3.9112 3.8638 3.9331 3.8431 3.6184 3.8417 3.9864 3.6828 3.8785 3.8941 3.5540 3.8875 4.0171 3.7972 3.9672 3.6814 3.9492 3.9429 3.9180 3.8980 3.9125 1.0188 1.0116 1.0063 1.0080 1.0103 1.0113 1.0094 1.0088 1.0074 1.0085 1.0065 1.0051 0.9967 0.9881 1.0101 1.0105 1.0097 1.0018 0.9994 0.9971 0.9905 1.0066 1.0025 1.0045 1.0243 0.9974 0.9909 0.9900 0.9902
dispcorr: -0.035836140 hartree
energy: -1510.106135075195
dipole: -18.74508 18.06320 -0.68188 11.41457 -11.87225 -0.45769 -3.04709 2.46178 -0.58531
magnitude: 1.00848 au
magnitude: 2.56335 debye
