program: Orca
programVersion: 5.0.2
elementType: Si F O O C C C C C C C C C C C C C C C C C C C C C C C C C H H H H H H H H H H H H H H H H H H H H H H H H H H H H H
charge: 0
multiplicity: 1
keywords: wb97x-d3
keywords: def2-TZVPP
keywords: def2/J RIJCOSX
keywords: DEFGRID2
keywords: scfconv7
keywords: smallprint printgap noloewdin
keywords: NOSOSCF
formula: C25H29FO2Si
InChI: InChI=1/C25H29FO2Si/c1-4-27-21-13-15-23(16-14-21)29(2,3)18-8-9-20-12-17-24(26)25(19-20)28-22-10-6-5-7-11-22/h5-7,10-17,19H,4,8-9,18H2,1-3H3
58 atoms
Si -3.508554 1.739356 0.795779
F  1.710567 -5.36972 -0.084791
O  1.660662 4.361431 -0.950426
O  2.27517 -2.802109 -0.616837
C  -3.68454 0.248003 -0.357566
C  -2.602214 -0.803425 -0.129995
C  -1.897082 2.606098 0.348836
C  -3.424658 1.167161 2.58689
C  -4.962481 2.90386 0.537554
C  -2.498948 -1.837768 -1.253239
C  -1.858637 3.68167 -0.544949
C  -0.666999 2.141902 0.817435
C  -1.383733 -2.812914 -1.000467
C  -0.666022 4.247303 -0.960836
C  0.543342 2.687879 0.409852
C  0.550719 3.747371 -0.494226
C  -0.067876 -2.356618 -0.963933
C  -1.628105 -4.158225 -0.745341
C  0.974013 -3.210019 -0.64394
C  -0.589155 -5.031042 -0.450418
C  0.698863 -4.546092 -0.388356
C  2.937963 3.769204 -0.743711
C  3.171472 2.555735 -1.618225
C  2.651126 -1.754757 0.177895
C  1.911426 -1.312718 1.268772
C  3.864444 -1.15561 -0.140377
C  2.395056 -0.256588 2.030529
C  4.336828 -0.109325 0.636408
C  3.60312 0.352344 1.721563
H  -4.678282 -0.199834 -0.249832
H  -3.633183 0.619721 -1.387848
H  -2.780462 -1.319835 0.817982
H  -1.626516 -0.318828 -0.026115
H  -4.323836 0.61443 2.869073
H  -2.572738 0.509649 2.772594
H  -3.334435 2.013541 3.271274
H  -5.898773 2.418857 0.823514
H  -4.872232 3.814157 1.133895
H  -5.066173 3.204428 -0.507133
H  -3.445609 -2.373495 -1.357422
H  -2.329265 -1.315068 -2.199427
H  -2.780732 4.094351 -0.939527
H  -0.628946 1.320542 1.524899
H  -0.667686 5.077968 -1.656835
H  1.460403 2.2709 0.804915
H  0.15113 -1.315588 -1.175379
H  -2.642437 -4.536075 -0.774031
H  -0.780421 -6.078261 -0.253603
H  3.095887 3.533381 0.313283
H  3.649784 4.554056 -1.000077
H  2.510378 1.723829 -1.374813
H  3.036519 2.803411 -2.672037
H  4.197657 2.21033 -1.488386
H  0.972245 -1.778082 1.538301
H  4.43382 -1.511697 -0.990018
H  1.81725 0.085491 2.879757
H  5.283537 0.350999 0.384255
H  3.971791 1.173409 2.322182
elementType: Si F O C H
totalener: -1510.06849499 hartree
nucrepener: 2896.48108419 hartree
electener: -4406.54957919 hartree
oneelecener: -7822.50907719 hartree
twoeener: 3415.95949800 hartree
cpcmener: -0.02335660 hartree
kineticenergy: 1503.91101938 hartree
xcener: -135.231733048891 hartree
chargesum: 0.0000000
charge: 0.488452 -0.216590 -0.337551 -0.329821 -0.256163 -0.092940 -0.147630 -0.421777 -0.458657 -0.068154 -0.097017 -0.182139 0.005200 -0.270518 -0.216840 0.305303 -0.217045 -0.181892 0.189862 -0.174246 0.196229 0.055603 -0.274186 0.325875 -0.193005 -0.238840 -0.185091 -0.147136 -0.179343 0.085336 0.075084 0.088223 0.046876 0.107036 0.099834 0.109128 0.105430 0.106037 0.100201 0.079273 0.090249 0.135656 0.147828 0.131341 0.131084 0.148146 0.140181 0.147442 0.081490 0.107912 0.079505 0.102829 0.094809 0.154535 0.144188 0.161832 0.159310 0.159258
qa: 0.4885 -0.2166 -0.3376 -0.3298 -0.2562 -0.0929 -0.1476 -0.4218 -0.4587 -0.0682 -0.0970 -0.1821 0.0052 -0.2705 -0.2168 0.3053 -0.2170 -0.1819 0.1899 -0.1742 0.1962 0.0556 -0.2742 0.3259 -0.1930 -0.2388 -0.1851 -0.1471 -0.1793 0.0853 0.0751 0.0882 0.0469 0.1070 0.0998 0.1091 0.1054 0.1060 0.1002 0.0793 0.0902 0.1357 0.1478 0.1313 0.1311 0.1481 0.1402 0.1474 0.0815 0.1079 0.0795 0.1028 0.0948 0.1545 0.1442 0.1618 0.1593 0.1593
va: 4.1405 1.0706 2.0753 2.0877 3.8428 3.8813 3.7609 3.8833 3.9279 3.8109 3.8873 3.8917 3.6776 4.0427 3.8263 3.7911 3.9338 3.8961 3.6876 3.8765 4.0665 3.8456 3.9190 3.6791 3.8488 3.9572 3.8637 3.8548 3.8249 1.0141 1.0162 1.0059 1.0089 1.0074 1.0096 1.0084 1.0111 1.0095 1.0108 1.0147 1.0064 0.9882 0.9802 1.0154 1.0213 0.9975 1.0033 0.9987 0.9967 0.9932 1.0004 1.0096 1.0069 0.9998 1.0094 0.9901 0.9886 0.9901
dispcorr: -0.032050632 hartree
energy: -1510.100545625692
dipole: -17.71575 17.16941 -0.54633 25.02936 -24.69239 0.33697 3.18391 -2.92861 0.25531
magnitude: 0.69080 au
magnitude: 1.75588 debye
