program: Orca
programVersion: 5.0.2
elementType: Si F O O C C C C C C C C C C C C C C C C C C C C C C C C C H H H H H H H H H H H H H H H H H H H H H H H H H H H H H
charge: 0
multiplicity: 1
keywords: wb97x-d3
keywords: def2-TZVPP
keywords: def2/J RIJCOSX
keywords: DEFGRID2
keywords: scfconv7
keywords: smallprint printgap noloewdin
keywords: NOSOSCF
formula: C25H29FO2Si
InChI: InChI=1/C25H29FO2Si/c1-4-27-21-13-15-23(16-14-21)29(2,3)18-8-9-20-12-17-24(26)25(19-20)28-22-10-6-5-7-11-22/h5-7,10-17,19H,4,8-9,18H2,1-3H3
58 atoms
Si -3.768457 1.724833 0.906838
F  1.45138 -4.36115 -2.961765
O  1.917773 3.728772 0.484134
O  2.237961 -3.270886 -0.676837
C  -3.573312 -0.131107 1.226235
C  -2.643317 -0.82595 0.234141
C  -2.03864 2.449477 0.752369
C  -4.669009 2.518669 2.357132
C  -4.727344 2.027179 -0.68334
C  -2.448316 -2.317592 0.524747
C  -1.120331 2.313516 1.802078
C  -1.576918 3.063924 -0.408403
C  -1.422409 -2.923291 -0.390305
C  0.185077 2.751863 1.693976
C  -0.267876 3.517793 -0.541773
C  0.6254 3.353071 0.512081
C  -0.069546 -2.824743 -0.07191
C  -1.786294 -3.524503 -1.590768
C  0.903819 -3.294044 -0.940972
C  -0.822713 -4.017349 -2.460146
C  0.508783 -3.890624 -2.131845
C  2.464883 4.249814 -0.719998
C  3.945947 4.443257 -0.51057
C  2.816961 -2.21352 -0.029122
C  3.910068 -2.511609 0.773812
C  2.397529 -0.898622 -0.19294
C  4.58723 -1.48651 1.417045
C  3.07747 0.114681 0.468702
C  4.171409 -0.16988 1.274163
H  -3.191491 -0.269362 2.244604
H  -4.562177 -0.603918 1.216053
H  -1.663221 -0.33941 0.245891
H  -3.022203 -0.711671 -0.786731
H  -4.124657 2.384121 3.294469
H  -4.80005 3.592559 2.207771
H  -5.662348 2.085221 2.495799
H  -5.735976 1.614584 -0.604337
H  -4.834282 3.09238 -0.899338
H  -4.257522 1.561385 -1.551928
H  -2.134753 -2.44051 1.565079
H  -3.402633 -2.839712 0.419113
H  -1.42091 1.839289 2.730786
H  -2.242224 3.197572 -1.253935
H  0.878348 2.625766 2.517214
H  0.031822 3.989485 -1.468147
H  0.223549 -2.370848 0.867933
H  -2.832711 -3.617033 -1.854016
H  -1.103149 -4.492325 -3.391788
H  1.98508 5.201273 -0.973598
H  2.285953 3.557063 -1.549001
H  4.446454 3.498307 -0.29462
H  4.38909 4.853652 -1.418071
H  4.150654 5.138737 0.30396
H  4.230004 -3.539992 0.886775
H  1.553775 -0.653323 -0.8253
H  5.4415 -1.723773 2.037984
H  2.747295 1.138147 0.348375
H  4.695847 0.628088 1.783164
elementType: Si F O C H
totalener: -1510.07225033 hartree
nucrepener: 2840.36306288 hartree
electener: -4350.43531321 hartree
oneelecener: -7710.71741539 hartree
twoeener: 3360.28210218 hartree
cpcmener: -0.02284047 hartree
kineticenergy: 1503.90105939 hartree
xcener: -135.225749982692 hartree
chargesum: 0.0000000
charge: 0.487954 -0.218348 -0.330514 -0.326829 -0.277806 -0.130352 -0.192538 -0.425605 -0.435976 -0.048959 -0.092917 -0.126758 0.032844 -0.297126 -0.244524 0.344178 -0.243031 -0.220283 0.226768 -0.161801 0.172071 0.035989 -0.269171 0.335893 -0.276710 -0.263437 -0.086470 -0.073093 -0.247198 0.084407 0.085455 0.075151 0.089270 0.099314 0.101978 0.102053 0.108948 0.106136 0.101881 0.083955 0.085738 0.132244 0.141765 0.133354 0.136256 0.146266 0.141279 0.147903 0.112518 0.099334 0.084728 0.090794 0.087732 0.144808 0.150569 0.157139 0.170488 0.152285
qa: 0.4880 -0.2183 -0.3305 -0.3268 -0.2778 -0.1304 -0.1925 -0.4256 -0.4360 -0.0490 -0.0929 -0.1268 0.0328 -0.2971 -0.2445 0.3442 -0.2430 -0.2203 0.2268 -0.1618 0.1721 0.0360 -0.2692 0.3359 -0.2767 -0.2634 -0.0865 -0.0731 -0.2472 0.0844 0.0855 0.0752 0.0893 0.0993 0.1020 0.1021 0.1089 0.1061 0.1019 0.0840 0.0857 0.1322 0.1418 0.1334 0.1363 0.1463 0.1413 0.1479 0.1125 0.0993 0.0847 0.0908 0.0877 0.1448 0.1506 0.1571 0.1705 0.1523
va: 4.1306 1.0669 2.0647 2.0857 3.8480 3.8413 3.7714 3.9000 3.9146 3.7839 3.8411 3.8896 3.6676 4.0193 3.9081 3.7127 3.9272 3.9135 3.6864 3.8750 4.0597 3.7937 3.9760 3.6731 4.0198 3.9498 3.8617 3.7802 3.9682 1.0146 1.0172 1.0074 1.0058 1.0106 1.0086 1.0090 1.0092 1.0075 1.0077 1.0105 1.0104 0.9932 0.9902 1.0151 1.0130 1.0041 1.0031 0.9984 0.9885 0.9866 1.0019 1.0061 1.0035 1.0091 1.0060 0.9887 0.9705 0.9968
dispcorr: -0.029031353 hartree
energy: -1510.101281683636
dipole: -17.84703 17.06930 -0.77773 28.91829 -27.80127 1.11702 10.28614 -10.23565 0.05049
magnitude: 1.36203 au
magnitude: 3.46201 debye
