program: Orca
programVersion: 5.0.2
elementType: Si F O O C C C C C C C C C C C C C C C C C C C C C C C C C H H H H H H H H H H H H H H H H H H H H H H H H H H H H H
charge: 0
multiplicity: 1
keywords: wb97x-d3
keywords: def2-TZVPP
keywords: def2/J RIJCOSX
keywords: DEFGRID2
keywords: scfconv7
keywords: smallprint printgap noloewdin
keywords: NOSOSCF
formula: C25H29FO2Si
InChI: InChI=1/C25H29FO2Si/c1-4-27-21-13-15-23(16-14-21)29(2,3)18-8-9-20-12-17-24(26)25(19-20)28-22-10-6-5-7-11-22/h5-7,10-17,19H,4,8-9,18H2,1-3H3
58 atoms
Si -3.48104 1.740583 0.779997
F  1.724295 -5.340061 -0.003106
O  1.682718 4.294317 -1.079543
O  2.274748 -2.762586 -0.543726
C  -3.685249 0.242985 -0.360289
C  -2.612784 -0.816478 -0.123203
C  -1.867004 2.586188 0.301632
C  -3.378634 1.180368 2.573912
C  -4.923072 2.922245 0.533182
C  -2.49367 -1.845597 -1.249831
C  -1.833843 3.631171 -0.627981
C  -0.634127 2.13376 0.774523
C  -1.376217 -2.81404 -0.982779
C  -0.643773 4.18065 -1.071385
C  0.574005 2.663257 0.338952
C  0.575465 3.694306 -0.597634
C  -0.064178 -2.348541 -0.935409
C  -1.614151 -4.158297 -0.716516
C  0.979929 -3.19022 -0.592948
C  -0.572283 -5.020398 -0.401183
C  0.711773 -4.525721 -0.327989
C  2.956109 3.68437 -0.902204
C  3.140433 2.453779 -1.764696
C  2.612262 -1.71596 0.270192
C  1.850295 -1.319481 1.363448
C  3.804435 -1.067486 -0.029768
C  2.291973 -0.26301 2.149306
C  4.234661 -0.019679 0.769919
C  3.479904 0.393453 1.860085
H  -4.683909 -0.192191 -0.248149
H  -3.630126 0.606364 -1.393315
H  -2.808229 -1.33681 0.81917
H  -1.635905 -0.338296 -0.000875
H  -4.280833 0.640887 2.871701
H  -2.532739 0.513253 2.752515
H  -3.268735 2.030009 3.251364
H  -5.039852 3.213626 -0.51272
H  -5.861633 2.454839 0.84002
H  -4.808366 3.837279 1.117939
H  -3.436599 -2.384919 -1.367952
H  -2.313458 -1.31855 -2.191571
H  -2.758296 4.032034 -1.029154
H  -0.592549 1.334322 1.506538
H  -0.649217 4.98785 -1.794452
H  1.494155 2.256886 0.738505
H  0.150202 -1.307672 -1.152747
H  -2.625466 -4.543592 -0.752089
H  -0.758181 -6.067016 -0.196225
H  3.143417 3.462198 0.152907
H  3.672408 4.452879 -1.193093
H  2.474974 1.637002 -1.484497
H  2.971795 2.687079 -2.816951
H  4.164907 2.093191 -1.66559
H  0.925478 -1.821138 1.616949
H  4.39117 -1.386214 -0.88248
H  1.697144 0.042252 3.000741
H  5.165479 0.479359 0.532371
H  3.816179 1.214869 2.478954
elementType: Si F O C H
totalener: -1510.06840007 hartree
nucrepener: 2904.89168572 hartree
electener: -4414.96008580 hartree
oneelecener: -7839.34454617 hartree
twoeener: 3424.38446037 hartree
cpcmener: -0.02326789 hartree
kineticenergy: 1503.91106248 hartree
xcener: -135.231741723048 hartree
chargesum: 0.0000000
charge: 0.487170 -0.216580 -0.338199 -0.331308 -0.257265 -0.090604 -0.143187 -0.421457 -0.457852 -0.069460 -0.102284 -0.187788 0.004001 -0.259843 -0.201870 0.289277 -0.211989 -0.180365 0.182816 -0.175598 0.200949 0.053601 -0.272849 0.320235 -0.186733 -0.238814 -0.190265 -0.150550 -0.165802 0.085745 0.074663 0.088764 0.044157 0.107290 0.099621 0.109270 0.099868 0.105188 0.105735 0.079624 0.090055 0.135351 0.149505 0.131244 0.128008 0.148500 0.140377 0.147332 0.081305 0.107302 0.080634 0.103638 0.093772 0.153999 0.143747 0.160629 0.158602 0.158690
qa: 0.4872 -0.2166 -0.3382 -0.3313 -0.2573 -0.0906 -0.1432 -0.4215 -0.4579 -0.0695 -0.1023 -0.1878 0.0040 -0.2598 -0.2019 0.2893 -0.2120 -0.1804 0.1828 -0.1756 0.2009 0.0536 -0.2728 0.3202 -0.1867 -0.2388 -0.1903 -0.1506 -0.1658 0.0857 0.0747 0.0888 0.0442 0.1073 0.0996 0.1093 0.0999 0.1052 0.1057 0.0796 0.0901 0.1354 0.1495 0.1312 0.1280 0.1485 0.1404 0.1473 0.0813 0.1073 0.0806 0.1036 0.0938 0.1540 0.1437 0.1606 0.1586 0.1587
va: 4.1394 1.0707 2.0737 2.0857 3.8444 3.8810 3.7583 3.8849 3.9270 3.8139 3.8935 3.8933 3.6769 4.0364 3.8066 3.8008 3.9297 3.8952 3.6917 3.8777 4.0640 3.8475 3.9164 3.6758 3.8405 3.9467 3.8671 3.8515 3.8201 1.0140 1.0164 1.0061 1.0084 1.0074 1.0097 1.0085 1.0111 1.0112 1.0096 1.0147 1.0067 0.9883 0.9794 1.0154 1.0253 0.9961 1.0032 0.9987 0.9959 0.9931 1.0005 1.0096 1.0074 0.9998 1.0093 0.9911 0.9882 0.9906
dispcorr: -0.032327600 hartree
energy: -1510.100727674083
dipole: -17.78567 17.20971 -0.57596 24.74945 -24.43964 0.30982 2.62369 -2.38709 0.23660
magnitude: 0.69549 au
magnitude: 1.76778 debye
