program: Orca
programVersion: 5.0.2
elementType: Si F O O C C C C C C C C C C C C C C C C C C C C C C C C C H H H H H H H H H H H H H H H H H H H H H H H H H H H H H
charge: 0
multiplicity: 1
keywords: wb97x-d3
keywords: def2-TZVPP
keywords: def2/J RIJCOSX
keywords: DEFGRID2
keywords: scfconv7
keywords: smallprint printgap noloewdin
keywords: NOSOSCF
formula: C25H29FO2Si
InChI: InChI=1/C25H29FO2Si/c1-4-27-21-13-15-23(16-14-21)29(2,3)18-8-9-20-12-17-24(26)25(19-20)28-22-10-6-5-7-11-22/h5-7,10-17,19H,4,8-9,18H2,1-3H3
58 atoms
Si -3.780557 1.618195 0.997751
F  1.556791 -3.851909 -3.123737
O  1.826599 3.72034 0.165941
O  2.317715 -3.059603 -0.708745
C  -3.534144 -0.225098 1.370463
C  -2.586381 -0.889251 0.375803
C  -2.085757 2.381911 0.695848
C  -4.620414 2.476069 2.446237
C  -4.822208 1.792867 -0.560958
C  -2.386942 -2.393465 0.587477
C  -1.320139 2.923946 1.734672
C  -1.488372 2.335672 -0.563412
C  -1.350307 -2.903896 -0.3721
C  -0.027051 3.372205 1.534382
C  -0.190036 2.777398 -0.790986
C  0.554572 3.290991 0.267658
C  -0.000575 -2.801132 -0.044452
C  -1.70078 -3.368688 -1.635368
C  0.983506 -3.115013 -0.969238
C  -0.725394 -3.707383 -2.563176
C  0.602481 -3.560447 -2.228082
C  2.515109 3.566424 -1.068413
C  3.945878 3.996097 -0.859516
C  2.827767 -2.074866 0.095088
C  2.37639 -0.761276 0.049645
C  3.871365 -2.436634 0.934959
C  2.972542 0.185887 0.869907
C  4.467752 -1.474536 1.737372
C  4.016771 -0.16261 1.715573
H  -3.145104 -0.342538 2.387916
H  -4.510379 -0.723498 1.360694
H  -1.60735 -0.40501 0.431657
H  -2.938883 -0.730221 -0.648949
H  -5.623674 2.075886 2.609619
H  -4.06868 2.343212 3.379177
H  -4.722561 3.549762 2.275523
H  -4.933194 2.83739 -0.859651
H  -4.394749 1.255018 -1.409846
H  -5.825864 1.391114 -0.402586
H  -2.072065 -2.577812 1.618058
H  -3.334452 -2.918558 0.443634
H  -1.733031 2.995573 2.734981
H  -2.035013 1.935323 -1.410074
H  0.546013 3.781543 2.357903
H  0.219485 2.710298 -1.790081
H  0.28104 -2.453468 0.942864
H  -2.744885 -3.461604 -1.907403
H  -0.993982 -4.066018 -3.548749
H  2.040965 4.175412 -1.845496
H  2.47714 2.522149 -1.396996
H  4.012055 5.03834 -0.545726
H  4.445445 3.376438 -0.113663
H  4.494024 3.894942 -1.796225
H  1.569292 -0.469731 -0.610929
H  4.215919 -3.462895 0.955132
H  2.616974 1.20733 0.843825
H  5.283807 -1.75898 2.388885
H  4.474756 0.584145 2.350761
elementType: Si F O C H
totalener: -1510.07089482 hartree
nucrepener: 2870.02520112 hartree
electener: -4380.09609594 hartree
oneelecener: -7769.83153405 hartree
twoeener: 3389.73543810 hartree
cpcmener: -0.02288532 hartree
kineticenergy: 1503.91336483 hartree
xcener: -135.228912376290 hartree
chargesum: 0.0000000
charge: 0.492080 -0.218401 -0.331687 -0.329682 -0.247773 -0.150508 -0.166910 -0.459781 -0.417030 -0.058022 -0.079872 -0.138164 0.055090 -0.281180 -0.260215 0.322414 -0.246064 -0.236045 0.225584 -0.155447 0.170491 0.031418 -0.266483 0.317058 -0.234352 -0.262968 -0.107557 -0.099745 -0.226193 0.082095 0.079440 0.077749 0.093286 0.104250 0.099320 0.106220 0.108186 0.096994 0.105712 0.083593 0.084151 0.136588 0.139365 0.132936 0.137587 0.145008 0.141893 0.147438 0.113460 0.093494 0.090187 0.084197 0.090002 0.151333 0.145560 0.178071 0.157297 0.154527
qa: 0.4921 -0.2184 -0.3317 -0.3297 -0.2478 -0.1505 -0.1669 -0.4598 -0.4170 -0.0580 -0.0799 -0.1382 0.0551 -0.2812 -0.2602 0.3224 -0.2461 -0.2360 0.2256 -0.1554 0.1705 0.0314 -0.2665 0.3171 -0.2344 -0.2630 -0.1076 -0.0997 -0.2262 0.0821 0.0794 0.0777 0.0933 0.1042 0.0993 0.1062 0.1082 0.0970 0.1057 0.0836 0.0842 0.1366 0.1394 0.1329 0.1376 0.1450 0.1419 0.1474 0.1135 0.0935 0.0902 0.0842 0.0900 0.1513 0.1456 0.1781 0.1573 0.1545
va: 4.1282 1.0665 2.0507 2.0830 3.8184 3.8893 3.7071 3.9219 3.8828 3.8121 3.8636 3.8777 3.6637 4.0432 3.8978 3.7070 3.9210 3.9190 3.6835 3.8723 4.0594 3.7980 3.9703 3.7012 3.9392 4.0164 3.8153 3.8707 3.9723 1.0158 1.0173 1.0012 0.9995 1.0110 1.0123 1.0095 1.0070 1.0125 1.0093 1.0118 1.0115 0.9887 0.9904 1.0145 1.0117 1.0040 1.0029 0.9982 0.9906 0.9858 1.0038 1.0036 1.0061 1.0032 1.0080 0.9691 0.9886 0.9959
dispcorr: -0.030022103 hartree
energy: -1510.100916923011
dipole: -18.00309 17.29069 -0.71240 24.66713 -24.06733 0.59980 10.95136 -10.75284 0.19852
magnitude: 0.95220 au
magnitude: 2.42030 debye
