program: Orca
programVersion: 5.0.2
elementType: Si F O O C C C C C C C C C C C C C C C C C C C C C C C C C H H H H H H H H H H H H H H H H H H H H H H H H H H H H H
charge: 0
multiplicity: 1
keywords: wb97x-d3
keywords: def2-TZVPP
keywords: def2/J RIJCOSX
keywords: DEFGRID2
keywords: scfconv7
keywords: smallprint printgap noloewdin
keywords: NOSOSCF
formula: C25H29FO2Si
InChI: InChI=1/C25H29FO2Si/c1-4-27-21-13-15-23(16-14-21)29(2,3)18-8-9-20-12-17-24(26)25(19-20)28-22-10-6-5-7-11-22/h5-7,10-17,19H,4,8-9,18H2,1-3H3
58 atoms
Si -3.521668 1.863008 0.201989
F  1.63786 -4.978922 -1.860852
O  1.929823 3.36774 2.360935
O  2.187159 -2.814388 -0.346528
C  -3.734973 0.048158 0.70276
C  -2.710828 -0.860611 0.024977
C  -1.823377 2.413411 0.803169
C  -4.855858 2.915942 1.008048
C  -3.597188 2.023909 -1.672759
C  -2.576404 -2.244915 0.666028
C  -1.647009 3.06382 2.029587
C  -0.663976 2.113038 0.086562
C  -1.46237 -3.030686 0.031492
C  -0.392103 3.381852 2.517908
C  0.607798 2.412665 0.559175
C  0.752282 3.048771 1.790081
C  -0.148986 -2.585432 0.165156
C  -1.700804 -4.165244 -0.737511
C  0.893486 -3.233085 -0.474402
C  -0.660958 -4.837909 -1.366424
C  0.625188 -4.357788 -1.240911
C  3.152706 3.03315 1.715482
C  3.540181 4.017684 0.632981
C  2.535827 -1.578339 -0.816809
C  1.793458 -0.883914 -1.764627
C  3.716247 -1.042459 -0.315558
C  2.246492 0.352387 -2.20696
C  4.157425 0.189892 -0.772486
C  3.424871 0.897084 -1.717527
H  -3.622924 -0.009194 1.791962
H  -4.753483 -0.292256 0.488073
H  -1.724711 -0.387369 0.046292
H  -2.960777 -0.977249 -1.033635
H  -4.713274 3.979523 0.805425
H  -5.844289 2.64422 0.630396
H  -4.882755 2.788891 2.092291
H  -4.558836 1.678925 -2.059911
H  -3.472197 3.061678 -1.989571
H  -2.822326 1.437979 -2.171465
H  -2.378331 -2.121012 1.734924
H  -3.517956 -2.792871 0.583159
H  -2.507969 3.330867 2.632583
H  -0.731837 1.624095 -0.879371
H  -0.287558 3.883391 3.472849
H  1.462262 2.138957 -0.045611
H  0.070387 -1.71065 0.76808
H  -2.712384 -4.534272 -0.853148
H  -0.851275 -5.720393 -1.963941
H  3.119827 2.009853 1.329174
H  3.900189 3.046139 2.509428
H  4.515597 3.742592 0.229091
H  2.832122 4.037297 -0.195804
H  3.621995 5.028544 1.034479
H  0.87565 -1.290955 -2.168999
H  4.285808 -1.592582 0.423214
H  1.666118 0.889421 -2.946336
H  5.079006 0.601036 -0.380479
H  3.770287 1.859852 -2.070347
elementType: Si F O C H
totalener: -1510.06875704 hartree
nucrepener: 2899.32595752 hartree
electener: -4409.39471456 hartree
oneelecener: -7828.28374730 hartree
twoeener: 3418.88903274 hartree
cpcmener: -0.02288271 hartree
kineticenergy: 1503.89712935 hartree
xcener: -135.229361172300 hartree
chargesum: 0.0000000
charge: 0.489121 -0.216639 -0.333547 -0.331507 -0.256335 -0.092152 -0.133297 -0.458952 -0.422612 -0.069636 -0.105111 -0.218355 0.000873 -0.268363 -0.179973 0.310590 -0.200014 -0.178131 0.165029 -0.177652 0.212517 0.068432 -0.278619 0.289237 -0.178800 -0.202245 -0.189436 -0.176151 -0.144858 0.074806 0.086198 0.044152 0.089240 0.106585 0.105417 0.100422 0.106814 0.108943 0.099793 0.089842 0.079796 0.136652 0.149282 0.131449 0.100919 0.145922 0.141339 0.147807 0.069861 0.108375 0.094151 0.091917 0.098343 0.149945 0.145003 0.158323 0.156858 0.158435
qa: 0.4891 -0.2166 -0.3335 -0.3315 -0.2563 -0.0922 -0.1333 -0.4590 -0.4226 -0.0696 -0.1051 -0.2184 0.0009 -0.2684 -0.1800 0.3106 -0.2000 -0.1781 0.1650 -0.1777 0.2125 0.0684 -0.2786 0.2892 -0.1788 -0.2022 -0.1894 -0.1762 -0.1449 0.0748 0.0862 0.0442 0.0892 0.1066 0.1054 0.1004 0.1068 0.1089 0.0998 0.0898 0.0798 0.1367 0.1493 0.1314 0.1009 0.1459 0.1413 0.1478 0.0699 0.1084 0.0942 0.0919 0.0983 0.1499 0.1450 0.1583 0.1569 0.1584
va: 4.1403 1.0710 2.0854 2.0835 3.8421 3.8785 3.7493 3.9283 3.8832 3.8160 3.8980 3.9275 3.6846 4.0388 3.8037 3.7937 3.9294 3.8951 3.7031 3.8809 4.0605 3.8371 3.9042 3.7047 3.8303 3.9556 3.8738 3.8812 3.7902 1.0166 1.0141 1.0088 1.0067 1.0093 1.0112 1.0105 1.0074 1.0083 1.0099 1.0065 1.0145 0.9884 0.9811 1.0156 1.0465 1.0016 1.0028 0.9985 1.0087 0.9950 1.0074 1.0007 1.0092 1.0029 1.0074 0.9931 0.9898 0.9894
dispcorr: -0.032087188 hartree
energy: -1510.100844227162
dipole: -17.24106 16.63141 -0.60965 28.83800 -28.30959 0.52841 3.43405 -3.74568 -0.31162
magnitude: 0.86487 au
magnitude: 2.19833 debye
