program: Orca
programVersion: 5.0.2
elementType: Si F O O C C C C C C C C C C C C C C C C C C C C C C C C C H H H H H H H H H H H H H H H H H H H H H H H H H H H H H
charge: 0
multiplicity: 1
keywords: wb97x-d3
keywords: def2-TZVPP
keywords: def2/J RIJCOSX
keywords: DEFGRID2
keywords: scfconv7
keywords: smallprint printgap noloewdin
keywords: NOSOSCF
formula: C25H29FO2Si
InChI: InChI=1/C25H29FO2Si/c1-4-27-21-13-15-23(16-14-21)29(2,3)18-8-9-20-12-17-24(26)25(19-20)28-22-10-6-5-7-11-22/h5-7,10-17,19H,4,8-9,18H2,1-3H3
58 atoms
Si -3.729339 1.809811 0.393828
F  1.44883 -5.339588 0.495518
O  1.993084 3.528072 1.327023
O  2.187749 -3.228217 -0.946935
C  -3.627964 0.381988 -0.845219
C  -2.659688 -0.712332 -0.402312
C  -1.977302 2.421259 0.708105
C  -4.477285 1.197877 2.008772
C  -4.766952 3.211139 -0.31331
C  -2.515378 -1.852138 -1.414995
C  -1.223781 1.976359 1.800722
C  -1.33958 3.28185 -0.183641
C  -1.475793 -2.839471 -0.967147
C  0.09122 2.360395 1.988336
C  -0.018733 3.683712 -0.017741
C  0.707804 3.217595 1.075108
C  -0.129246 -2.578077 -1.208169
C  -1.816924 -3.97687 -0.241911
C  0.859386 -3.414737 -0.713972
C  -0.837277 -4.832566 0.243388
C  0.48885 -4.53637 0.015339
C  2.710553 4.331414 0.399536
C  4.129779 4.453695 0.894917
C  2.725403 -1.970521 -0.879124
C  2.317338 -1.032064 0.061134
C  3.751425 -1.682229 -1.768365
C  2.942144 0.206351 0.094482
C  4.372354 -0.442524 -1.716391
C  3.967272 0.509353 -0.79115
H  -4.628359 -0.036354 -1.004906
H  -3.312238 0.78326 -1.815246
H  -2.975848 -1.133796 0.557308
H  -1.67043 -0.278225 -0.227191
H  -3.931916 0.349959 2.427906
H  -4.496899 1.981293 2.769421
H  -5.508102 0.869363 1.855487
H  -4.813472 4.060303 0.371735
H  -4.371482 3.578188 -1.262809
H  -5.793392 2.886024 -0.498781
H  -3.478563 -2.351368 -1.547432
H  -2.239035 -1.434115 -2.386863
H  -1.6657 1.306589 2.53008
H  -1.873656 3.662155 -1.047912
H  0.652536 1.997385 2.841288
H  0.420128 4.354543 -0.744272
H  0.150204 -1.70292 -1.783962
H  -2.858472 -4.202449 -0.048748
H  -1.101152 -5.718007 0.807843
H  2.247805 5.320863 0.318308
H  2.689666 3.872823 -0.594843
H  4.703683 5.069851 0.202679
H  4.172729 4.927468 1.876304
H  4.618025 3.480374 0.958927
H  1.52501 -1.253909 0.765055
H  4.062134 -2.425499 -2.492039
H  2.628529 0.936052 0.828762
H  5.173112 -0.221759 -2.410421
H  4.450195 1.477399 -0.755414
elementType: Si F O C H
totalener: -1510.07209099 hartree
nucrepener: 2853.72074905 hartree
electener: -4363.79284004 hartree
oneelecener: -7737.43583043 hartree
twoeener: 3373.64299039 hartree
cpcmener: -0.02339057 hartree
kineticenergy: 1503.91179999 hartree
xcener: -135.227781574208 hartree
chargesum: -0.0000000
charge: 0.498854 -0.218200 -0.327486 -0.330612 -0.253869 -0.138418 -0.191624 -0.429293 -0.452280 -0.054525 -0.063497 -0.128965 0.032878 -0.318717 -0.254215 0.343051 -0.219127 -0.218014 0.199522 -0.164227 0.180514 0.033191 -0.275706 0.290287 -0.186384 -0.246865 -0.143064 -0.128312 -0.195882 0.082085 0.079157 0.090418 0.076330 0.098226 0.110431 0.107573 0.104588 0.099706 0.103702 0.084597 0.085159 0.141277 0.134544 0.134412 0.137791 0.145614 0.140763 0.147698 0.111161 0.097560 0.092484 0.093741 0.084301 0.149964 0.144950 0.167182 0.156313 0.159257
qa: 0.4989 -0.2182 -0.3275 -0.3306 -0.2539 -0.1384 -0.1916 -0.4293 -0.4523 -0.0545 -0.0635 -0.1290 0.0329 -0.3187 -0.2542 0.3431 -0.2191 -0.2180 0.1995 -0.1642 0.1805 0.0332 -0.2757 0.2903 -0.1864 -0.2469 -0.1431 -0.1283 -0.1959 0.0821 0.0792 0.0904 0.0763 0.0982 0.1104 0.1076 0.1046 0.0997 0.1037 0.0846 0.0852 0.1413 0.1345 0.1344 0.1378 0.1456 0.1408 0.1477 0.1112 0.0976 0.0925 0.0937 0.0843 0.1500 0.1449 0.1672 0.1563 0.1593
va: 4.1349 1.0675 2.0561 2.0793 3.8368 3.8690 3.7487 3.8974 3.9122 3.7946 3.7855 3.9200 3.6651 4.0156 3.9263 3.7034 3.9123 3.9129 3.7002 3.8778 4.0595 3.7922 3.9727 3.7028 3.9162 4.0065 3.8604 3.9197 3.9178 1.0169 1.0158 1.0033 1.0057 1.0097 1.0067 1.0087 1.0090 1.0117 1.0101 1.0112 1.0104 0.9885 0.9932 1.0143 1.0114 1.0042 1.0033 0.9984 0.9892 0.9857 1.0053 1.0045 1.0022 1.0035 1.0077 0.9911 0.9905 0.9868
dispcorr: -0.029915484 hartree
energy: -1510.102006474277
dipole: -17.14498 16.42365 -0.72133 33.07847 -31.51500 1.56347 -0.07655 -0.65221 -0.72876
magnitude: 1.86972 au
magnitude: 4.75245 debye
