program: Orca
programVersion: 5.0.2
elementType: Si F O O C C C C C C C C C C C C C C C C C C C C C C C C C H H H H H H H H H H H H H H H H H H H H H H H H H H H H H
charge: 0
multiplicity: 1
keywords: wb97x-d3
keywords: def2-TZVPP
keywords: def2/J RIJCOSX
keywords: DEFGRID2
keywords: scfconv7
keywords: smallprint printgap noloewdin
keywords: NOSOSCF
formula: C25H29FO2Si
InChI: InChI=1/C25H29FO2Si/c1-4-27-21-13-15-23(16-14-21)29(2,3)18-8-9-20-12-17-24(26)25(19-20)28-22-10-6-5-7-11-22/h5-7,10-17,19H,4,8-9,18H2,1-3H3
58 atoms
Si -3.540326 1.384496 0.411149
F  1.508759 -4.334489 1.102953
O  2.245156 2.990144 1.188517
O  1.894188 -1.959206 0.028961
C  -3.537428 -0.418872 -0.153378
C  -2.982997 -0.604081 -1.564921
C  -1.751758 1.912499 0.678558
C  -4.491499 1.542219 2.026926
C  -4.325206 2.474539 -0.907547
C  -2.654873 -2.055674 -1.915019
C  -1.15133 1.825985 1.933452
C  -0.944063 2.365705 -0.372709
C  -1.557328 -2.65802 -1.076107
C  0.177823 2.171485 2.151852
C  0.381868 2.709768 -0.183197
C  0.954494 2.621492 1.087517
C  -0.337368 -1.996594 -0.931859
C  -1.729875 -3.882323 -0.44092
C  0.69593 -2.558601 -0.199366
C  -0.703892 -4.45422 0.301857
C  0.498719 -3.794995 0.404688
C  2.885029 2.929132 2.456451
C  4.310766 3.389259 2.28163
C  2.443078 -1.103238 -0.887874
C  3.070798 0.027324 -0.386582
C  2.441035 -1.369696 -2.251544
C  3.699939 0.902717 -1.260413
C  3.062409 -0.478653 -3.114263
C  3.693034 0.658293 -2.626363
H  -2.939104 -0.985298 0.569679
H  -4.54839 -0.83647 -0.094319
H  -2.086511 0.006485 -1.712231
H  -3.708436 -0.229874 -2.292071
H  -5.547188 1.30563 1.874398
H  -4.120559 0.859694 2.794408
H  -4.441532 2.553921 2.434684
H  -3.789421 2.436723 -1.858078
H  -5.35405 2.165155 -1.106817
H  -4.355624 3.520532 -0.594589
H  -3.555491 -2.666995 -1.816908
H  -2.363915 -2.107221 -2.969126
H  -1.724979 1.483123 2.787617
H  -1.35362 2.460574 -1.37237
H  0.582887 2.086387 3.151318
H  0.982558 3.056703 -1.015586
H  -0.189573 -1.031144 -1.400873
H  -2.673674 -4.406188 -0.52638
H  -0.838129 -5.409723 0.792897
H  2.859253 1.906454 2.847538
H  2.363116 3.57113 3.174175
H  4.859354 2.744559 1.59354
H  4.359633 4.413855 1.911353
H  4.8216 3.358244 3.244129
H  3.073539 0.21215 0.6803
H  1.964343 -2.259252 -2.643642
H  4.191354 1.783749 -0.868296
H  3.05752 -0.68346 -4.177084
H  4.17843 1.3460 -3.306218
elementType: Si F O C H
totalener: -1510.07077556 hartree
nucrepener: 2942.90583238 hartree
electener: -4452.97660793 hartree
oneelecener: -7916.58508340 hartree
twoeener: 3463.60847547 hartree
cpcmener: -0.02422817 hartree
kineticenergy: 1503.90883424 hartree
xcener: -135.231015227503 hartree
chargesum: -0.0000000
charge: 0.478368 -0.218483 -0.323325 -0.325665 -0.234660 -0.128788 -0.144893 -0.457686 -0.427873 -0.098735 -0.141552 -0.116674 -0.026963 -0.237403 -0.297664 0.332984 -0.230426 -0.182302 0.263440 -0.163480 0.169312 0.034518 -0.274714 0.309929 -0.258636 -0.200631 -0.128582 -0.142222 -0.180313 0.079268 0.084785 0.070526 0.090834 0.105546 0.099728 0.105441 0.100538 0.107042 0.109665 0.080166 0.097166 0.137270 0.143493 0.136572 0.130629 0.142445 0.138172 0.146760 0.096376 0.110893 0.086620 0.089220 0.094552 0.145006 0.155191 0.152231 0.159010 0.157971
qa: 0.4784 -0.2185 -0.3233 -0.3257 -0.2347 -0.1288 -0.1449 -0.4577 -0.4279 -0.0987 -0.1416 -0.1167 -0.0270 -0.2374 -0.2977 0.3330 -0.2304 -0.1823 0.2634 -0.1635 0.1693 0.0345 -0.2747 0.3099 -0.2586 -0.2006 -0.1286 -0.1422 -0.1803 0.0793 0.0848 0.0705 0.0908 0.1055 0.0997 0.1054 0.1005 0.1070 0.1097 0.0802 0.0972 0.1373 0.1435 0.1366 0.1306 0.1424 0.1382 0.1468 0.0964 0.1109 0.0866 0.0892 0.0946 0.1450 0.1552 0.1522 0.1590 0.1580
va: 4.1427 1.0666 2.0607 2.0837 3.8133 3.8940 3.7171 3.9223 3.8902 3.8572 3.9336 3.8458 3.7142 3.9116 4.0081 3.7258 3.8920 3.8839 3.6158 3.8840 4.0536 3.7972 3.9708 3.7075 3.9229 3.9065 3.8524 3.8910 3.9316 1.0147 1.0124 1.0028 1.0059 1.0111 1.0109 1.0100 1.0091 1.0070 1.0088 1.0076 1.0001 0.9902 0.9850 1.0118 1.0174 0.9979 1.0026 0.9988 0.9842 0.9897 1.0004 1.0030 1.0065 1.0086 0.9966 0.9953 0.9896 0.9908
dispcorr: -0.032021522 hartree
energy: -1510.102797077544
dipole: -16.73382 16.06958 -0.66424 23.60589 -23.06151 0.54438 -0.45913 0.20283 -0.25630
magnitude: 0.89624 au
magnitude: 2.27807 debye
