program: Orca
programVersion: 5.0.2
elementType: Si F O O C C C C C C C C C C C C C C C C C C C C C C C C C H H H H H H H H H H H H H H H H H H H H H H H H H H H H H
charge: 0
multiplicity: 1
keywords: wb97x-d3
keywords: def2-TZVPP
keywords: def2/J RIJCOSX
keywords: DEFGRID2
keywords: scfconv7
keywords: smallprint printgap noloewdin
keywords: NOSOSCF
formula: C25H29FO2Si
InChI: InChI=1/C25H29FO2Si/c1-4-27-21-13-15-23(16-14-21)29(2,3)18-8-9-20-12-17-24(26)25(19-20)28-22-10-6-5-7-11-22/h5-7,10-17,19H,4,8-9,18H2,1-3H3
58 atoms
Si -3.506507 1.473469 0.548153
F  1.232259 -3.241149 -3.242951
O  2.295092 3.183774 0.305708
O  1.848475 -1.781661 -1.131884
C  -3.525579 -0.373083 0.139407
C  -2.890235 -1.222207 1.239298
C  -1.717207 2.057129 0.467344
C  -4.174099 1.759299 2.285172
C  -4.530407 2.433598 -0.704824
C  -2.603914 -2.66766 0.829518
C  -0.86019 1.98609 1.572989
C  -1.163725 2.529086 -0.721667
C  -1.594495 -2.805154 -0.27993
C  0.468859 2.36037 1.496088
C  0.167798 2.916384 -0.824299
C  0.994882 2.834407 0.292856
C  -0.33829 -2.208719 -0.162595
C  -1.882495 -3.532522 -1.42856
C  0.616828 -2.356003 -1.155736
C  -0.93626 -3.68133 -2.435842
C  0.301499 -3.101151 -2.286831
C  2.897697 3.653857 -0.892715
C  4.355071 3.91928 -0.609434
C  2.449173 -1.48442 0.064301
C  2.566797 -2.427805 1.077473
C  2.99465 -0.217967 0.20375
C  3.234146 -2.085348 2.244042
C  3.669832 0.107691 1.372577
C  3.787372 -0.820247 2.397159
H  -4.549147 -0.713796 -0.050764
H  -2.985993 -0.505225 -0.805544
H  -3.550028 -1.239359 2.110751
H  -1.959347 -0.764408 1.589209
H  -5.200318 1.395007 2.375012
H  -3.585071 1.248208 3.049337
H  -4.182869 2.821417 2.539683
H  -4.466303 3.510749 -0.536843
H  -4.21412 2.243141 -1.732538
H  -5.585091 2.156227 -0.639566
H  -2.243108 -3.214997 1.706177
H  -3.535734 -3.153382 0.528923
H  -1.231951 1.631995 2.528096
H  -1.77694 2.607251 -1.612894
H  1.109059 2.293741 2.367717
H  0.536014 3.278915 -1.77465
H  -0.101805 -1.624849 0.718996
H  -2.854394 -3.995378 -1.544814
H  -1.158972 -4.251811 -3.328671
H  2.400973 4.569577 -1.23132
H  2.795787 2.908397 -1.688653
H  4.482185 4.664604 0.176475
H  4.879549 3.009194 -0.314599
H  4.834916 4.30116 -1.510743
H  2.14762 -3.419685 0.961696
H  2.898959 0.50011 -0.600911
H  3.326514 -2.817955 3.035465
H  4.095583 1.09642 1.483701
H  4.309076 -0.561473 3.309189
elementType: Si F O C H
totalener: -1510.07112556 hartree
nucrepener: 2940.52278328 hartree
electener: -4450.59390884 hartree
oneelecener: -7911.74839937 hartree
twoeener: 3461.15449053 hartree
cpcmener: -0.02397052 hartree
kineticenergy: 1503.90391694 hartree
xcener: -135.229650325514 hartree
chargesum: 0.0000000
charge: 0.481458 -0.219233 -0.323603 -0.326625 -0.234820 -0.129096 -0.146556 -0.431914 -0.456274 -0.100824 -0.109880 -0.142919 -0.031296 -0.291513 -0.236428 0.323240 -0.215543 -0.184043 0.244643 -0.161935 0.173510 0.029446 -0.274478 0.285700 -0.182597 -0.240258 -0.145951 -0.135522 -0.173072 0.084721 0.079456 0.090576 0.071889 0.107890 0.099988 0.110513 0.105298 0.099772 0.104372 0.098640 0.080377 0.142783 0.135568 0.131680 0.136567 0.141295 0.138342 0.146621 0.114362 0.096586 0.089366 0.087609 0.094625 0.154759 0.147094 0.158781 0.148551 0.158305
qa: 0.4815 -0.2192 -0.3236 -0.3266 -0.2348 -0.1291 -0.1466 -0.4319 -0.4563 -0.1008 -0.1099 -0.1429 -0.0313 -0.2915 -0.2364 0.3232 -0.2155 -0.1840 0.2446 -0.1619 0.1735 0.0294 -0.2745 0.2857 -0.1826 -0.2403 -0.1460 -0.1355 -0.1731 0.0847 0.0795 0.0906 0.0719 0.1079 0.1000 0.1105 0.1053 0.0998 0.1044 0.0986 0.0804 0.1428 0.1356 0.1317 0.1366 0.1413 0.1383 0.1466 0.1144 0.0966 0.0894 0.0876 0.0946 0.1548 0.1471 0.1588 0.1486 0.1583
va: 4.1392 1.0655 2.0561 2.0792 3.8118 3.8911 3.7159 3.8929 3.9190 3.8559 3.8416 3.9374 3.7165 4.0097 3.9097 3.7264 3.8752 3.8799 3.6330 3.8865 4.0505 3.7981 3.9662 3.7382 3.9127 3.9201 3.8942 3.8619 3.9330 1.0129 1.0154 1.0057 1.0030 1.0071 1.0089 1.0088 1.0097 1.0114 1.0114 1.0003 1.0081 0.9855 0.9911 1.0163 1.0116 1.0021 1.0029 0.9987 0.9897 0.9837 1.0033 1.0006 1.0066 0.9964 1.0051 0.9897 1.0013 0.9905
dispcorr: -0.031971487 hartree
energy: -1510.103097047957
dipole: -15.50199 14.91947 -0.58252 20.36693 -20.03498 0.33194 13.25619 -12.68836 0.56783
magnitude: 0.87860 au
magnitude: 2.23323 debye
