program: Orca
programVersion: 5.0.2
elementType: Si F O O C C C C C C C C C C C C C C C C C C C C C C C C C H H H H H H H H H H H H H H H H H H H H H H H H H H H H H
charge: 0
multiplicity: 1
keywords: wb97x-d3
keywords: def2-TZVPP
keywords: def2/J RIJCOSX
keywords: DEFGRID2
keywords: scfconv7
keywords: smallprint printgap noloewdin
keywords: NOSOSCF
formula: C25H29FO2Si
InChI: InChI=1/C25H29FO2Si/c1-4-27-21-13-15-23(16-14-21)29(2,3)18-8-9-20-12-17-24(26)25(19-20)28-22-10-6-5-7-11-22/h5-7,10-17,19H,4,8-9,18H2,1-3H3
58 atoms
Si -2.781984 1.355589 0.423903
F  0.979335 -5.263092 0.455104
O  2.406177 4.431667 0.883848
O  1.671291 -3.186153 -1.091272
C  -2.343235 -0.094009 -0.703804
C  -3.476158 -1.070824 -1.003593
C  -1.203865 2.360351 0.634081
C  -3.370697 0.730001 2.097689
C  -4.120443 2.413795 -0.374041
C  -3.075672 -2.209776 -1.954708
C  -0.614587 2.59784 1.873371
C  -0.53419 2.867075 -0.487735
C  -1.995121 -3.080083 -1.379365
C  0.583979 3.293265 2.009284
C  0.656021 3.559563 -0.380136
C  1.232804 3.7721 0.874619
C  -0.654413 -2.748739 -1.553664
C  -2.307615 -4.193163 -0.602272
C  0.3485 -3.478159 -0.933407
C  -1.312239 -4.946258 0.003743
C  0.00546 -4.56962 -0.151103
C  3.061149 4.670372 2.122408
C  4.349528 5.399607 1.833009
C  2.093335 -1.90221 -0.866779
C  1.535778 -1.096569 0.118947
C  3.144993 -1.441434 -1.646337
C  2.034515 0.184483 0.308678
C  3.641456 -0.162611 -1.435767
C  3.086052 0.658829 -0.463997
H  -1.946264 0.309809 -1.642924
H  -1.504259 -0.617538 -0.233636
H  -4.318167 -0.53824 -1.455536
H  -3.855849 -1.504903 -0.07328
H  -3.578813 1.546389 2.792463
H  -4.296304 0.159164 1.99359
H  -2.638771 0.071579 2.570231
H  -4.360182 3.286824 0.236937
H  -3.813973 2.779546 -1.356708
H  -5.047095 1.851891 -0.512663
H  -3.957675 -2.815646 -2.175696
H  -2.742739 -1.778843 -2.902729
H  -1.086796 2.231689 2.778119
H  -0.943341 2.71494 -1.481151
H  0.993648 3.442101 2.999585
H  1.156597 3.932624 -1.265823
H  -0.384655 -1.900615 -2.172606
H  -3.342917 -4.479823 -0.463501
H  -1.558108 -5.810663 0.607422
H  3.265377 3.722562 2.631859
H  2.422296 5.269462 2.780124
H  4.167736 6.35793 1.345268
H  4.872272 5.59659 2.769134
H  5.011613 4.807704 1.199966
H  0.723116 -1.455062 0.738571
H  3.570141 -2.079934 -2.410731
H  1.596348 0.81209 1.074532
H  4.46151 0.194028 -2.045725
H  3.468206 1.65953 -0.308092
elementType: Si F O C H
totalener: -1510.07130418 hartree
nucrepener: 2896.88831423 hartree
electener: -4406.95961841 hartree
oneelecener: -7823.95741676 hartree
twoeener: 3416.99779836 hartree
cpcmener: -0.02356239 hartree
kineticenergy: 1503.91092217 hartree
xcener: -135.230714564245 hartree
chargesum: 0.0000000
charge: 0.506081 -0.217631 -0.328424 -0.335069 -0.228276 -0.141261 -0.185143 -0.448122 -0.423078 -0.101060 -0.143062 -0.077293 0.065926 -0.236152 -0.332699 0.355264 -0.246653 -0.214347 0.209165 -0.166016 0.184422 0.054815 -0.273837 0.293878 -0.204964 -0.244647 -0.164915 -0.120386 -0.192937 0.087614 0.059152 0.081225 0.079736 0.106302 0.107181 0.107611 0.105611 0.102882 0.100839 0.090165 0.088835 0.139188 0.130272 0.134149 0.130167 0.153305 0.141663 0.147720 0.094037 0.101906 0.087334 0.089371 0.087915 0.157983 0.145513 0.184305 0.156494 0.157946
qa: 0.5061 -0.2176 -0.3284 -0.3351 -0.2283 -0.1413 -0.1851 -0.4481 -0.4231 -0.1011 -0.1431 -0.0773 0.0659 -0.2362 -0.3327 0.3553 -0.2467 -0.2143 0.2092 -0.1660 0.1844 0.0548 -0.2738 0.2939 -0.2050 -0.2446 -0.1649 -0.1204 -0.1929 0.0876 0.0592 0.0812 0.0797 0.1063 0.1072 0.1076 0.1056 0.1029 0.1008 0.0902 0.0888 0.1392 0.1303 0.1341 0.1302 0.1533 0.1417 0.1477 0.0940 0.1019 0.0873 0.0894 0.0879 0.1580 0.1455 0.1843 0.1565 0.1579
va: 4.1084 1.0690 2.0568 2.0799 3.8232 3.9239 3.7690 3.9240 3.8941 3.8588 3.8703 3.8147 3.5984 3.8813 4.0290 3.6648 3.9157 3.9158 3.6726 3.8757 4.0766 3.7915 3.9796 3.6904 3.9016 4.0072 3.8430 3.9208 3.8878 1.0149 1.0291 1.0087 1.0033 1.0084 1.0091 1.0061 1.0092 1.0080 1.0080 1.0082 1.0092 0.9915 0.9947 1.0144 1.0177 1.0000 1.0019 0.9981 0.9865 0.9886 1.0034 1.0059 1.0021 0.9988 1.0071 0.9714 0.9898 0.9962
dispcorr: -0.032032630 hartree
energy: -1510.103336807672
dipole: -13.58284 12.72596 -0.85688 30.59760 -29.51007 1.08752 5.28960 -4.77592 0.51368
magnitude: 1.47676 au
magnitude: 3.75363 debye
