program: Orca
programVersion: 5.0.2
elementType: Si F O O C C C C C C C C C C C C C C C C C C C C C C C C C H H H H H H H H H H H H H H H H H H H H H H H H H H H H H
charge: 0
multiplicity: 1
keywords: wb97x-d3
keywords: def2-TZVPP
keywords: def2/J RIJCOSX
keywords: DEFGRID2
keywords: scfconv7
keywords: smallprint printgap noloewdin
keywords: NOSOSCF
formula: C25H29FO2Si
InChI: InChI=1/C25H29FO2Si/c1-4-27-21-13-15-23(16-14-21)29(2,3)18-8-9-20-12-17-24(26)25(19-20)28-22-10-6-5-7-11-22/h5-7,10-17,19H,4,8-9,18H2,1-3H3
58 atoms
Si -3.641712 1.692558 0.246582
F  1.553897 -5.352246 -0.443528
O  2.085041 3.334337 1.31063
O  2.030429 -2.976452 -1.504651
C  -3.93987 0.034779 1.121409
C  -2.81693 -1.000294 1.048179
C  -1.866895 2.226867 0.57362
C  -4.826073 2.954012 0.994281
C  -3.953687 1.60814 -1.608671
C  -2.553382 -1.520461 -0.364984
C  -0.916515 2.371852 -0.442304
C  -1.43251 2.469376 1.877145
C  -1.465138 -2.556552 -0.40169
C  0.390045 2.741831 -0.175567
C  -0.12586 2.837309 2.1722
C  0.797384 2.979125 1.138039
C  -0.220053 -2.248208 -0.942471
C  -1.672749 -3.828852 0.124805
C  0.806127 -3.183789 -0.951601
C  -0.659577 -4.775459 0.112275
C  0.567359 -4.443681 -0.419724
C  2.572099 3.555367 2.628159
C  4.031779 3.922788 2.531975
C  2.571278 -1.718565 -1.55662
C  3.183303 -1.347515 -2.744895
C  2.572444 -0.86619 -0.459442
C  3.803229 -0.109096 -2.835782
C  3.185549 0.373372 -0.569075
C  3.80015 0.759186 -1.753392
H  -4.135292 0.265424 2.174778
H  -4.873715 -0.400484 0.746086
H  -3.062327 -1.849024 1.694364
H  -1.892275 -0.574809 1.448965
H  -4.72325 3.932068 0.519529
H  -5.866204 2.641165 0.873798
H  -4.653688 3.091151 2.064191
H  -3.245896 0.974283 -2.1447
H  -4.952195 1.21078 -1.806733
H  -3.909442 2.601363 -2.061432
H  -3.478795 -1.939478 -0.771633
H  -2.274689 -0.692379 -1.020115
H  -1.19309 2.195644 -1.475696
H  -2.123579 2.370619 2.708029
H  1.103972 2.851435 -0.983179
H  0.149517 3.009388 3.204106
H  -0.054987 -1.263796 -1.364539
H  -2.635575 -4.091889 0.545033
H  -0.817568 -5.76741 0.516295
H  2.44419 2.652934 3.23515
H  2.008443 4.361731 3.109392
H  4.620768 3.122854 2.081738
H  4.178565 4.83277 1.949081
H  4.425301 4.102081 3.532646
H  3.180447 -2.027079 -3.587979
H  2.103854 -1.158033 0.472167
H  4.284528 0.177058 -3.76212
H  3.182356 1.041714 0.281471
H  4.275677 1.728252 -1.82894
elementType: Si F O C H
totalener: -1510.07006914 hartree
nucrepener: 2876.72627153 hartree
electener: -4386.79634068 hartree
oneelecener: -7783.57716242 hartree
twoeener: 3396.78082174 hartree
cpcmener: -0.02319585 hartree
kineticenergy: 1503.90196935 hartree
xcener: -135.227898800440 hartree
chargesum: 0.0000000
charge: 0.452519 -0.219057 -0.329401 -0.327019 -0.271897 -0.134335 -0.128601 -0.450090 -0.430244 -0.029993 -0.083069 -0.169580 -0.024908 -0.319139 -0.251697 0.376837 -0.182284 -0.225124 0.214475 -0.174380 0.187132 0.042838 -0.274587 0.314080 -0.263951 -0.224919 -0.093810 -0.123241 -0.217814 0.097010 0.084744 0.093843 0.079349 0.099879 0.101280 0.098657 0.103323 0.109892 0.111776 0.096226 0.056391 0.142757 0.134054 0.132083 0.137295 0.139261 0.143361 0.146282 0.099683 0.106622 0.088392 0.087222 0.091824 0.145601 0.153814 0.158140 0.168169 0.154330
qa: 0.4525 -0.2191 -0.3294 -0.3270 -0.2719 -0.1343 -0.1286 -0.4501 -0.4302 -0.0300 -0.0831 -0.1696 -0.0249 -0.3191 -0.2517 0.3768 -0.1823 -0.2251 0.2145 -0.1744 0.1871 0.0428 -0.2746 0.3141 -0.2640 -0.2249 -0.0938 -0.1232 -0.2178 0.0970 0.0847 0.0938 0.0793 0.0999 0.1013 0.0987 0.1033 0.1099 0.1118 0.0962 0.0564 0.1428 0.1341 0.1321 0.1373 0.1393 0.1434 0.1463 0.0997 0.1066 0.0884 0.0872 0.0918 0.1456 0.1538 0.1581 0.1682 0.1543
va: 4.1021 1.0657 2.0671 2.0811 3.8387 3.8671 3.7296 3.9072 3.8916 3.7514 3.8125 3.9290 3.7370 4.0102 3.9202 3.6996 3.8791 3.9185 3.7065 3.9026 4.0429 3.7937 3.9768 3.6705 4.0259 3.9389 3.8634 3.7891 3.9187 1.0094 1.0162 1.0084 1.0068 1.0110 1.0101 1.0122 1.0085 1.0099 1.0067 1.0071 1.0272 0.9877 0.9949 1.0145 1.0118 1.0061 1.0012 0.9998 0.9873 0.9876 1.0016 1.0034 1.0058 1.0080 1.0019 0.9879 0.9886 0.9951
dispcorr: -0.030438235 hartree
energy: -1510.100507377841
dipole: -17.80504 17.05309 -0.75195 30.95559 -29.67641 1.27918 10.42723 -9.40738 1.01985
magnitude: 1.80051 au
magnitude: 4.57654 debye
