program: Orca
programVersion: 5.0.2
elementType: Si F O O C C C C C C C C C C C C C C C C C C C C C C C C C H H H H H H H H H H H H H H H H H H H H H H H H H H H H H
charge: 0
multiplicity: 1
keywords: wb97x-d3
keywords: def2-TZVPP
keywords: def2/J RIJCOSX
keywords: DEFGRID2
keywords: scfconv7
keywords: smallprint printgap noloewdin
keywords: NOSOSCF
formula: C25H29FO2Si
InChI: InChI=1/C25H29FO2Si/c1-4-27-21-13-15-23(16-14-21)29(2,3)18-8-9-20-12-17-24(26)25(19-20)28-22-10-6-5-7-11-22/h5-7,10-17,19H,4,8-9,18H2,1-3H3
58 atoms
Si -3.511524 1.826815 0.345724
F  1.336132 -5.581869 0.500254
O  2.186199 3.866887 0.217118
O  2.078809 -3.29728 -0.65757
C  -3.594631 0.291525 -0.753093
C  -2.644555 -0.820275 -0.317498
C  -1.738433 2.462785 0.34613
C  -4.01413 1.402225 2.109464
C  -4.670733 3.145557 -0.336547
C  -2.626935 -2.018626 -1.27106
C  -0.946535 2.411009 -0.808713
C  -1.149854 3.015345 1.481444
C  -1.590647 -3.025556 -0.858818
C  0.352037 2.883739 -0.829605
C  0.153394 3.502172 1.485966
C  0.914886 3.437326 0.322454
C  -0.241816 -2.707512 -1.004109
C  -1.93124 -4.238784 -0.272107
C  0.747976 -3.55731 -0.538972
C  -0.947908 -5.114329 0.171877
C  0.377077 -4.76045 0.048791
C  2.818125 4.451173 1.348788
C  4.221374 4.836977 0.952866
C  2.522404 -2.005201 -0.534025
C  2.048982 -1.15461 0.458237
C  3.505996 -1.58582 -1.416841
C  2.561482 0.130955 0.549177
C  4.021181 -0.301555 -1.303177
C  3.546982 0.564755 -0.328805
H  -4.627074 -0.075848 -0.766683
H  -3.375712 0.584821 -1.786535
H  -2.908381 -1.170027 0.685425
H  -1.627004 -0.425441 -0.237608
H  -5.010377 0.953976 2.129225
H  -3.329409 0.691516 2.576426
H  -4.051413 2.286963 2.748721
H  -5.706064 2.796469 -0.352359
H  -4.642166 4.054574 0.268249
H  -4.405925 3.426031 -1.3584
H  -3.614613 -2.485129 -1.299244
H  -2.417619 -1.663085 -2.284388
H  -1.346073 1.986542 -1.723807
H  -1.70945 3.077328 2.408302
H  0.944209 2.824449 -1.735138
H  0.552743 3.920322 2.400254
H  0.036222 -1.771453 -1.475026
H  -2.972932 -4.509665 -0.153559
H  -1.210195 -6.060029 0.629128
H  2.840708 3.739962 2.181326
H  2.259173 5.332649 1.680877
H  4.805971 3.96837 0.646833
H  4.224597 5.562403 0.138526
H  4.725494 5.291757 1.805683
H  1.2890 -1.48366 1.155926
H  3.867177 -2.25945 -2.183917
H  2.187859 0.792276 1.320397
H  4.790248 0.023827 -1.991874
H  3.943404 1.568463 -0.2527
elementType: Si F O C H
totalener: -1510.07215855 hartree
nucrepener: 2865.58369373 hartree
electener: -4375.65585228 hartree
oneelecener: -7761.31076017 hartree
twoeener: 3385.65490789 hartree
cpcmener: -0.02393061 hartree
kineticenergy: 1503.90849314 hartree
xcener: -135.228305612556 hartree
chargesum: 0.0000000
charge: 0.489986 -0.218536 -0.323598 -0.331760 -0.285203 -0.115760 -0.162583 -0.444597 -0.417589 -0.053641 -0.096670 -0.137589 0.006744 -0.294368 -0.251239 0.329797 -0.210272 -0.205695 0.201418 -0.163048 0.178668 0.041074 -0.275102 0.279315 -0.169342 -0.232836 -0.178707 -0.139569 -0.157836 0.090325 0.081787 0.090637 0.064032 0.110612 0.107039 0.105543 0.101120 0.100252 0.100398 0.080109 0.088164 0.136083 0.136815 0.130391 0.135219 0.143437 0.140024 0.147583 0.096938 0.109667 0.088927 0.088377 0.092634 0.154620 0.145536 0.161299 0.155086 0.155888
qa: 0.4900 -0.2185 -0.3236 -0.3318 -0.2852 -0.1158 -0.1626 -0.4446 -0.4176 -0.0536 -0.0967 -0.1376 0.0067 -0.2944 -0.2512 0.3298 -0.2103 -0.2057 0.2014 -0.1630 0.1787 0.0411 -0.2751 0.2793 -0.1693 -0.2328 -0.1787 -0.1396 -0.1578 0.0903 0.0818 0.0906 0.0640 0.1106 0.1070 0.1055 0.1011 0.1003 0.1004 0.0801 0.0882 0.1361 0.1368 0.1304 0.1352 0.1434 0.1400 0.1476 0.0969 0.1097 0.0889 0.0884 0.0926 0.1546 0.1455 0.1613 0.1551 0.1559
va: 4.1373 1.0669 2.0587 2.0796 3.8691 3.8466 3.7416 3.9019 3.8903 3.7955 3.8099 3.9174 3.6964 3.9995 3.8985 3.6962 3.8868 3.9074 3.7015 3.8773 4.0567 3.7895 3.9780 3.6938 3.8872 4.0021 3.8656 3.9239 3.8423 1.0159 1.0155 1.0072 1.0056 1.0073 1.0056 1.0089 1.0084 1.0097 1.0089 1.0141 1.0087 0.9900 0.9910 1.0175 1.0130 1.0041 1.0040 0.9983 0.9856 0.9893 1.0001 1.0031 1.0060 0.9979 1.0065 0.9844 0.9912 0.9967
dispcorr: -0.030565245 hartree
energy: -1510.102723793725
dipole: -16.36144 15.61933 -0.74211 34.10366 -32.61595 1.48771 4.24945 -3.74058 0.50887
magnitude: 1.73867 au
magnitude: 4.41934 debye
