program: Orca
programVersion: 5.0.2
elementType: Si F O O C C C C C C C C C C C C C C C C C C C C C C C C C H H H H H H H H H H H H H H H H H H H H H H H H H H H H H
charge: 0
multiplicity: 1
keywords: wb97x-d3
keywords: def2-TZVPP
keywords: def2/J RIJCOSX
keywords: DEFGRID2
keywords: scfconv7
keywords: smallprint printgap noloewdin
keywords: NOSOSCF
formula: C25H29FO2Si
InChI: InChI=1/C25H29FO2Si/c1-4-27-21-13-15-23(16-14-21)29(2,3)18-8-9-20-12-17-24(26)25(19-20)28-22-10-6-5-7-11-22/h5-7,10-17,19H,4,8-9,18H2,1-3H3
58 atoms
Si -3.347523 -0.018118 0.075957
F  3.697682 0.340637 0.017635
O  1.165437 1.375471 3.84715
O  2.595515 -1.068753 -1.942312
C  -2.56666 -0.343979 -1.618521
C  -2.24174 0.860491 -2.506617
C  -2.015285 0.449337 1.319122
C  -4.13254 -1.633297 0.648249
C  -4.642573 1.342147 -0.030752
C  -1.346873 1.938897 -1.900365
C  -1.988844 1.665194 1.995481
C  -0.955022 -0.432864 1.567305
C  0.010897 1.502565 -1.412564
C  -0.956374 2.013287 2.862456
C  0.081118 -0.11229 2.421653
C  0.097311 1.127365 3.066483
C  0.66095 0.389789 -1.936477
C  0.654849 2.239391 -0.419976
C  1.900219 -0.005387 -1.450989
C  1.901639 1.868183 0.058121
C  2.505273 0.738218 -0.450376
C  1.291913 2.649399 4.463438
C  2.611362 2.683312 5.194166
C  1.94939 -2.235082 -2.247065
C  0.888874 -2.724474 -1.49401
C  2.439726 -2.951516 -3.330045
C  0.310988 -3.935425 -1.848578
C  1.860554 -4.167104 -3.663229
C  0.788843 -4.660628 -2.931792
H  -1.675548 -0.961781 -1.461056
H  -3.259509 -0.992379 -2.166905
H  -3.175933 1.348506 -2.797844
H  -1.800197 0.508318 -3.444584
H  -3.394999 -2.437868 0.700942
H  -4.576626 -1.535065 1.641054
H  -4.920704 -1.963464 -0.032556
H  -4.216566 2.302529 -0.32836
H  -5.409439 1.088014 -0.766232
H  -5.152562 1.492983 0.92317
H  -1.211378 2.724796 -2.651187
H  -1.865916 2.426371 -1.070043
H  -2.786518 2.385314 1.849744
H  -0.926033 -1.400168 1.075735
H  -0.987407 2.97675 3.353717
H  0.895482 -0.808275 2.584831
H  0.200206 -0.189329 -2.727425
H  0.170848 3.113521 -0.002728
H  2.392421 2.438492 0.836644
H  0.463643 2.819905 5.159633
H  1.256442 3.44063 3.706425
H  3.450274 2.543006 4.511522
H  2.733438 3.65315 5.676798
H  2.661676 1.917249 5.968685
H  0.513045 -2.176166 -0.639105
H  3.272396 -2.56065 -3.90155
H  -0.520313 -4.312853 -1.266961
H  2.248248 -4.725492 -4.505559
H  0.333053 -5.604459 -3.200404
elementType: Si F O C H
totalener: -1510.06774309 hartree
nucrepener: 2995.08381507 hartree
electener: -4505.15155816 hartree
oneelecener: -8020.61665733 hartree
twoeener: 3515.46509917 hartree
cpcmener: -0.02527555 hartree
kineticenergy: 1503.90415826 hartree
xcener: -135.235350756603 hartree
chargesum: -0.0000000
charge: 0.472023 -0.219430 -0.325484 -0.331137 -0.228418 -0.149916 -0.110130 -0.451219 -0.438037 -0.079752 -0.146412 -0.111600 0.041267 -0.244111 -0.342060 0.370459 -0.237914 -0.217484 0.224741 -0.170715 0.196177 0.056280 -0.273096 0.277006 -0.179746 -0.230619 -0.174853 -0.133864 -0.169402 0.043226 0.097030 0.090026 0.084518 0.099769 0.100387 0.100893 0.103895 0.112050 0.110749 0.099881 0.077511 0.141663 0.144546 0.134310 0.128480 0.152120 0.135841 0.140514 0.098087 0.091884 0.087385 0.088892 0.087650 0.158890 0.144954 0.156715 0.157649 0.157929
qa: 0.4720 -0.2194 -0.3255 -0.3311 -0.2284 -0.1499 -0.1101 -0.4512 -0.4380 -0.0798 -0.1464 -0.1116 0.0413 -0.2441 -0.3421 0.3705 -0.2379 -0.2175 0.2247 -0.1707 0.1962 0.0563 -0.2731 0.2770 -0.1797 -0.2306 -0.1749 -0.1339 -0.1694 0.0432 0.0970 0.0900 0.0845 0.0998 0.1004 0.1009 0.1039 0.1121 0.1107 0.0999 0.0775 0.1417 0.1445 0.1343 0.1285 0.1521 0.1358 0.1405 0.0981 0.0919 0.0874 0.0889 0.0877 0.1589 0.1450 0.1567 0.1576 0.1579
va: 4.1100 1.0676 2.0648 2.0903 3.8457 3.9050 3.6616 3.9030 3.9142 3.8238 3.8528 3.8164 3.6472 3.8545 4.0089 3.6734 3.8955 3.8659 3.6723 3.8283 4.0597 3.7972 3.9752 3.7269 3.8597 3.9861 3.9161 3.8963 3.8941 1.0237 1.0119 0.9982 1.0008 1.0109 1.0101 1.0113 1.0075 1.0089 1.0090 1.0024 1.0078 0.9891 0.9783 1.0131 1.0168 0.9947 1.0034 1.0027 0.9873 0.9854 1.0035 1.0059 1.0033 0.9873 1.0083 0.9936 0.9893 0.9901
dispcorr: -0.034949406 hartree
energy: -1510.102692496891
dipole: -26.91745 25.43375 -1.48370 6.89080 -5.92369 0.96712 6.84060 -6.87691 -0.03631
magnitude: 1.77144 au
magnitude: 4.50264 debye
