program: Orca
programVersion: 5.0.2
elementType: Si F O O C C C C C C C C C C C C C C C C C C C C C C C C C H H H H H H H H H H H H H H H H H H H H H H H H H H H H H
charge: 0
multiplicity: 1
keywords: wb97x-d3
keywords: def2-TZVPP
keywords: def2/J RIJCOSX
keywords: DEFGRID2
keywords: scfconv7
keywords: smallprint printgap noloewdin
keywords: NOSOSCF
formula: C25H29FO2Si
InChI: InChI=1/C25H29FO2Si/c1-4-27-21-13-15-23(16-14-21)29(2,3)18-8-9-20-12-17-24(26)25(19-20)28-22-10-6-5-7-11-22/h5-7,10-17,19H,4,8-9,18H2,1-3H3
58 atoms
Si -2.876788 1.42309 0.2852
F  1.113432 -4.955196 0.862764
O  2.289334 3.901164 2.235547
O  1.79781 -3.102864 -0.932237
C  -2.333089 -0.095507 -0.697843
C  -3.441435 -1.076632 -1.068609
C  -1.30933 2.270938 0.8927
C  -3.90925 0.880255 1.76439
C  -3.872097 2.597439 -0.795871
C  -2.957021 -2.262879 -1.916766
C  -0.806805 3.434733 0.315105
C  -0.552903 1.707082 1.928068
C  -1.874903 -3.044118 -1.22857
C  0.389176 4.015116 0.724531
C  0.638785 2.264412 2.35282
C  1.125304 3.426764 1.749782
C  -0.536795 -2.73986 -1.459974
C  -2.183594 -4.023476 -0.288315
C  0.474319 -3.363583 -0.743638
C  -1.180832 -4.680448 0.409768
C  0.135389 -4.337393 0.184438
C  2.986761 4.929181 1.542012
C  3.640406 4.442364 0.265821
C  2.223896 -1.812007 -1.105128
C  3.321556 -1.627435 -1.934799
C  1.637126 -0.73095 -0.457181
C  3.831386 -0.350502 -2.120459
C  2.146729 0.542658 -0.668126
C  3.242194 0.740767 -1.497172
H  -1.810111 0.245453 -1.599495
H  -1.573729 -0.605448 -0.095699
H  -4.231772 -0.565294 -1.626669
H  -3.913399 -1.462124 -0.159493
H  -4.858082 0.441424 1.447461
H  -3.395288 0.130603 2.370285
H  -4.145711 1.722296 2.418481
H  -4.791011 2.117592 -1.14112
H  -4.166183 3.500019 -0.25597
H  -3.321008 2.909086 -1.685562
H  -3.806286 -2.914422 -2.136442
H  -2.588872 -1.888444 -2.875387
H  -1.351146 3.921929 -0.48628
H  -0.890735 0.799812 2.418042
H  0.723674 4.91882 0.232487
H  1.207438 1.802206 3.151079
H  -0.280831 -1.989105 -2.198394
H  -3.217737 -4.28087 -0.094632
H  -1.418098 -5.44689 1.136637
H  3.750124 5.265821 2.243593
H  2.333324 5.786131 1.352329
H  4.236799 5.249885 -0.16144
H  4.308575 3.603307 0.463373
H  2.916618 4.136926 -0.490142
H  3.773124 -2.478962 -2.428407
H  0.792185 -0.866631 0.206102
H  4.688632 -0.211096 -2.766492
H  1.682028 1.384668 -0.170495
H  3.634317 1.737228 -1.653772
elementType: Si F O C H
totalener: -1510.06821249 hartree
nucrepener: 2906.61718817 hartree
electener: -4416.68540066 hartree
oneelecener: -7843.21861667 hartree
twoeener: 3426.53321601 hartree
cpcmener: -0.02357528 hartree
kineticenergy: 1503.90441636 hartree
xcener: -135.231579491389 hartree
chargesum: -0.0000000
charge: 0.507655 -0.217948 -0.333571 -0.331288 -0.218760 -0.154655 -0.162151 -0.439849 -0.447027 -0.096851 -0.131603 -0.150623 0.061039 -0.225299 -0.265645 0.312150 -0.258500 -0.217105 0.237597 -0.163880 0.174160 0.049039 -0.266798 0.320741 -0.266257 -0.254411 -0.097499 -0.014906 -0.257001 0.088904 0.059182 0.081568 0.082410 0.105487 0.106249 0.110569 0.105581 0.109498 0.102461 0.091916 0.085766 0.138456 0.135606 0.139143 0.130978 0.148375 0.142283 0.147227 0.106857 0.084921 0.099072 0.088808 0.085006 0.143719 0.172874 0.156599 0.102617 0.157112
qa: 0.5077 -0.2179 -0.3336 -0.3313 -0.2188 -0.1547 -0.1622 -0.4398 -0.4470 -0.0969 -0.1316 -0.1506 0.0610 -0.2253 -0.2656 0.3121 -0.2585 -0.2171 0.2376 -0.1639 0.1742 0.0490 -0.2668 0.3207 -0.2663 -0.2544 -0.0975 -0.0149 -0.2570 0.0889 0.0592 0.0816 0.0824 0.1055 0.1062 0.1106 0.1056 0.1095 0.1025 0.0919 0.0858 0.1385 0.1356 0.1391 0.1310 0.1484 0.1423 0.1472 0.1069 0.0849 0.0991 0.0888 0.0850 0.1437 0.1729 0.1566 0.1026 0.1571
va: 4.1079 1.0679 2.0719 2.0895 3.8041 3.9170 3.7436 3.8894 3.9201 3.8522 3.8708 3.8609 3.5995 3.8463 3.9984 3.7282 3.9136 3.9142 3.6555 3.8778 4.0742 3.8635 3.9088 3.7109 4.0237 3.9259 3.8900 3.7645 3.9947 1.0142 1.0290 1.0106 1.0014 1.0060 1.0070 1.0088 1.0102 1.0080 1.0087 1.0079 1.0101 0.9912 0.9940 1.0061 1.0159 1.0020 1.0016 0.9984 0.9920 0.9951 1.0106 1.0047 0.9993 1.0084 0.9862 0.9896 1.0223 0.9912
dispcorr: -0.032512429 hartree
energy: -1510.100724915222
dipole: -15.54493 14.74160 -0.80333 29.87814 -28.34806 1.53008 -4.73590 3.78718 -0.94872
magnitude: 1.97143 au
magnitude: 5.01097 debye
