program: Orca
programVersion: 5.0.2
elementType: Si F O O C C C C C C C C C C C C C C C C C C C C C C C C C H H H H H H H H H H H H H H H H H H H H H H H H H H H H H
charge: 0
multiplicity: 1
keywords: wb97x-d3
keywords: def2-TZVPP
keywords: def2/J RIJCOSX
keywords: DEFGRID2
keywords: scfconv7
keywords: smallprint printgap noloewdin
keywords: NOSOSCF
formula: C25H29FO2Si
InChI: InChI=1/C25H29FO2Si/c1-4-27-21-13-15-23(16-14-21)29(2,3)18-8-9-20-12-17-24(26)25(19-20)28-22-10-6-5-7-11-22/h5-7,10-17,19H,4,8-9,18H2,1-3H3
58 atoms
Si -3.217637 1.125872 1.034903
F  2.161191 -1.634063 -2.59984
O  2.163528 2.574121 -1.29853
O  1.938287 -2.448081 -0.061552
C  -3.136896 -0.769137 1.013725
C  -3.668706 -1.443656 -0.257209
C  -1.603893 1.738889 0.277609
C  -3.342806 1.73542 2.810591
C  -4.693833 1.74412 0.04209
C  -2.965775 -2.766499 -0.593111
C  -0.69807 2.518383 0.993494
C  -1.197901 1.314916 -0.995831
C  -1.581301 -2.531925 -1.130747
C  0.563134 2.839851 0.501093
C  0.049253 1.619695 -1.506325
C  0.952866 2.368988 -0.748575
C  -0.456321 -2.628721 -0.318915
C  -1.409249 -2.145784 -2.460274
C  0.805485 -2.318689 -0.810272
C  -0.154687 -1.850165 -2.967127
C  0.940836 -1.926575 -2.131239
C  3.191478 3.161248 -0.511276
C  4.471373 3.111779 -1.308243
C  2.106247 -1.718381 1.081023
C  1.33233 -0.614739 1.415918
C  3.143276 -2.131476 1.910784
C  1.599649 0.061625 2.60021
C  3.401895 -1.438691 3.081975
C  2.627413 -0.341678 3.438551
H  -2.083337 -1.024987 1.172283
H  -3.662028 -1.173277 1.884956
H  -3.583703 -0.78958 -1.130305
H  -4.73936 -1.628138 -0.140575
H  -2.528284 1.358702 3.433071
H  -3.334602 2.825155 2.879076
H  -4.276382 1.393093 3.263504
H  -5.631885 1.326653 0.415343
H  -4.776405 2.831853 0.099022
H  -4.61965 1.482578 -1.015457
H  -2.926617 -3.400525 0.296169
H  -3.554536 -3.305264 -1.339717
H  -0.958129 2.885227 1.980107
H  -1.861824 0.716439 -1.610071
H  1.227497 3.436772 1.111979
H  0.342826 1.266005 -2.487625
H  -0.55631 -2.949934 0.711616
H  -2.270303 -2.073554 -3.113721
H  -0.02583 -1.552431 -4.000027
H  3.306671 2.611273 0.429181
H  2.936656 4.19676 -0.261465
H  5.277053 3.562535 -0.728479
H  4.759551 2.085435 -1.538015
H  4.38396 3.66602 -2.243435
H  0.530487 -0.27082 0.774614
H  3.743925 -2.989093 1.63389
H  0.989545 0.916286 2.861989
H  4.211906 -1.764508 3.721922
H  2.825426 0.193654 4.357756
elementType: Si F O C H
totalener: -1510.06715109 hartree
nucrepener: 3034.84877317 hartree
electener: -4544.91592426 hartree
oneelecener: -8100.24758244 hartree
twoeener: 3555.33165818 hartree
cpcmener: -0.02327093 hartree
kineticenergy: 1503.90423289 hartree
xcener: -135.232512556965 hartree
chargesum: 0.0000000
charge: 0.472659 -0.218497 -0.326461 -0.329215 -0.264583 -0.144044 -0.103751 -0.459771 -0.406059 -0.088292 -0.161816 -0.143738 0.099196 -0.275654 -0.275061 0.352720 -0.244668 -0.261492 0.249473 -0.161654 0.175892 0.068266 -0.272228 0.298431 -0.122918 -0.234267 -0.194936 -0.132362 -0.181887 0.074222 0.097028 0.071338 0.092778 0.103781 0.100921 0.107089 0.105058 0.106618 0.101679 0.086397 0.096433 0.143687 0.148348 0.134209 0.134143 0.150606 0.140653 0.147989 0.087585 0.091704 0.088596 0.087233 0.086773 0.085792 0.142921 0.161236 0.155725 0.156174
qa: 0.4727 -0.2185 -0.3265 -0.3292 -0.2646 -0.1440 -0.1038 -0.4598 -0.4061 -0.0883 -0.1618 -0.1437 0.0992 -0.2757 -0.2751 0.3527 -0.2447 -0.2615 0.2495 -0.1617 0.1759 0.0683 -0.2722 0.2984 -0.1229 -0.2343 -0.1949 -0.1324 -0.1819 0.0742 0.0970 0.0713 0.0928 0.1038 0.1009 0.1071 0.1051 0.1066 0.1017 0.0864 0.0964 0.1437 0.1483 0.1342 0.1341 0.1506 0.1407 0.1480 0.0876 0.0917 0.0886 0.0872 0.0868 0.0858 0.1429 0.1612 0.1557 0.1562
va: 4.1141 1.0650 2.0726 2.0939 3.8152 3.9004 3.7007 3.9316 3.8854 3.8374 3.8492 3.8427 3.5250 3.8415 3.9845 3.7234 3.9535 3.8755 3.6296 3.8225 4.0504 3.8017 3.9763 3.7482 3.7777 3.9608 3.8925 3.9141 3.9314 1.0111 1.0099 1.0011 1.0097 1.0097 1.0107 1.0125 1.0060 1.0098 1.0100 1.0092 1.0051 0.9889 0.9741 1.0125 1.0135 1.0022 1.0028 0.9982 0.9868 0.9864 1.0059 1.0040 1.0034 1.0362 1.0103 0.9953 0.9889 0.9911
dispcorr: -0.035687499 hartree
energy: -1510.102838590475
dipole: -17.73964 16.82432 -0.91532 15.22721 -14.80255 0.42466 12.36065 -11.44729 0.91336
magnitude: 1.36102 au
magnitude: 3.45945 debye
