program: Orca
programVersion: 5.0.2
elementType: Si F O O C C C C C C C C C C C C C C C C C C C C C C C C C H H H H H H H H H H H H H H H H H H H H H H H H H H H H H
charge: 0
multiplicity: 1
keywords: wb97x-d3
keywords: def2-TZVPP
keywords: def2/J RIJCOSX
keywords: DEFGRID2
keywords: scfconv7
keywords: smallprint printgap noloewdin
keywords: NOSOSCF
formula: C25H29FO2Si
InChI: InChI=1/C25H29FO2Si/c1-4-27-21-13-15-23(16-14-21)29(2,3)18-8-9-20-12-17-24(26)25(19-20)28-22-10-6-5-7-11-22/h5-7,10-17,19H,4,8-9,18H2,1-3H3
58 atoms
Si -3.498299 1.82998 0.395945
F  1.465741 -5.529381 0.482727
O  2.150021 3.986412 0.017441
O  2.138971 -3.25818 -0.743721
C  -3.586883 0.270916 -0.667875
C  -2.606838 -0.818359 -0.240931
C  -1.746837 2.51884 0.307202
C  -3.901408 1.424042 2.190385
C  -4.733162 3.096835 -0.251418
C  -2.602459 -2.031546 -1.175608
C  -0.949381 2.355221 -0.831774
C  -1.17523 3.212985 1.372315
C  -1.538499 -3.018131 -0.785697
C  0.340496 2.848661 -0.901458
C  0.117761 3.722257 1.32626
C  0.889644 3.538485 0.181517
C  -0.200158 -2.692633 -0.997367
C  -1.842552 -4.220634 -0.158379
C  0.816685 -3.52588 -0.561161
C  -0.833287 -5.07977 0.257712
C  0.481817 -4.720308 0.064786
C  2.814188 4.657916 1.081793
C  3.352504 3.712445 2.134246
C  2.576971 -1.960813 -0.661698
C  2.14616 -1.099764 0.340818
C  3.510943 -1.545583 -1.598866
C  2.646966 0.19289 0.384837
C  4.013858 -0.253176 -1.533561
C  3.578726 0.624233 -0.550759
H  -4.613203 -0.112562 -0.639915
H  -3.40739 0.544994 -1.714068
H  -2.836371 -1.154255 0.775066
H  -1.592768 -0.409172 -0.197856
H  -3.955581 2.321034 2.811175
H  -4.870352 0.925016 2.267865
H  -3.15816 0.762522 2.63982
H  -4.698706 4.021809 0.328426
H  -4.535067 3.358347 -1.293096
H  -5.756463 2.717252 -0.198981
H  -3.583506 -2.512572 -1.162576
H  -2.433342 -1.689182 -2.200838
H  -1.335306 1.823411 -1.694917
H  -1.739533 3.366521 2.285769
H  0.936463 2.700724 -1.794239
H  0.498801 4.249046 2.19078
H  0.048807 -1.764028 -1.498423
H  -2.875625 -4.496204 0.012922
H  -1.066423 -6.01814 0.744921
H  2.164443 5.418473 1.525141
H  3.638944 5.18829 0.605208
H  2.566446 3.158755 2.647889
H  4.051787 2.996274 1.700893
H  3.89353 4.287044 2.887612
H  1.428003 -1.426384 1.082501
H  3.841881 -2.228035 -2.371731
H  2.307197 0.863196 1.163964
H  4.742623 0.069366 -2.266007
H  3.961177 1.635728 -0.514668
elementType: Si F O C H
totalener: -1510.06969230 hartree
nucrepener: 2877.26921304 hartree
electener: -4387.33890534 hartree
oneelecener: -7784.65273535 hartree
twoeener: 3397.31383002 hartree
cpcmener: -0.02409688 hartree
kineticenergy: 1503.90509484 hartree
xcener: -135.229450524340 hartree
chargesum: -0.0000000
charge: 0.491876 -0.218396 -0.331093 -0.331674 -0.282181 -0.123081 -0.152509 -0.445626 -0.418837 -0.051903 -0.101595 -0.153388 0.006370 -0.302459 -0.237506 0.329622 -0.208345 -0.204892 0.198164 -0.163782 0.180167 0.042854 -0.285850 0.292257 -0.196745 -0.247713 -0.134678 -0.121801 -0.181648 0.090884 0.081603 0.091565 0.065425 0.106023 0.111155 0.106940 0.099690 0.100914 0.100814 0.080483 0.088123 0.138485 0.135019 0.130834 0.138106 0.143417 0.139762 0.147493 0.093514 0.109893 0.091781 0.092097 0.107473 0.153964 0.145085 0.163028 0.156359 0.144463
qa: 0.4919 -0.2184 -0.3311 -0.3317 -0.2822 -0.1231 -0.1525 -0.4456 -0.4188 -0.0519 -0.1016 -0.1534 0.0064 -0.3025 -0.2375 0.3296 -0.2083 -0.2049 0.1982 -0.1638 0.1802 0.0429 -0.2858 0.2923 -0.1967 -0.2477 -0.1347 -0.1218 -0.1816 0.0909 0.0816 0.0916 0.0654 0.1060 0.1112 0.1069 0.0997 0.1009 0.1008 0.0805 0.0881 0.1385 0.1350 0.1308 0.1381 0.1434 0.1398 0.1475 0.0935 0.1099 0.0918 0.0921 0.1075 0.1540 0.1451 0.1630 0.1564 0.1445
va: 4.1393 1.0671 2.0575 2.0790 3.8721 3.8511 3.7369 3.8969 3.8881 3.7900 3.8132 3.9200 3.6971 3.9997 3.8882 3.6927 3.8851 3.9071 3.7052 3.8782 4.0564 3.8357 3.9193 3.6811 3.9423 4.0192 3.8266 3.9273 3.8679 1.0150 1.0153 1.0078 1.0039 1.0095 1.0069 1.0052 1.0100 1.0089 1.0084 1.0139 1.0090 0.9889 0.9923 1.0175 1.0056 1.0040 1.0040 0.9985 0.9977 0.9934 1.0005 0.9998 1.0119 0.9991 1.0067 0.9803 0.9899 1.0089
dispcorr: -0.031307701 hartree
energy: -1510.101000002851
dipole: -18.24344 17.50101 -0.74243 31.77228 -30.28753 1.48475 7.04038 -6.46815 0.57223
magnitude: 1.75588 au
magnitude: 4.46310 debye
