program: Orca
programVersion: 5.0.2
elementType: Si F O O C C C C C C C C C C C C C C C C C C C C C C C C C H H H H H H H H H H H H H H H H H H H H H H H H H H H H H
charge: 0
multiplicity: 1
keywords: wb97x-d3
keywords: def2-TZVPP
keywords: def2/J RIJCOSX
keywords: DEFGRID2
keywords: scfconv7
keywords: smallprint printgap noloewdin
keywords: NOSOSCF
formula: C25H29FO2Si
InChI: InChI=1/C25H29FO2Si/c1-4-27-21-13-15-23(16-14-21)29(2,3)18-8-9-20-12-17-24(26)25(19-20)28-22-10-6-5-7-11-22/h5-7,10-17,19H,4,8-9,18H2,1-3H3
58 atoms
Si -2.794832 1.360142 0.484372
F  1.192307 -5.17494 0.645417
O  2.271295 4.671372 0.540557
O  1.758469 -3.128572 -0.992833
C  -2.347143 -0.123249 -0.595417
C  -3.44962 -1.160728 -0.786201
C  -1.255185 2.439739 0.569223
C  -3.269882 0.792907 2.214104
C  -4.21871 2.322136 -0.287257
C  -3.050347 -2.330336 -1.699368
C  -0.680681 2.949816 -0.601592
C  -0.593536 2.722094 1.762239
C  -1.919902 -3.141819 -1.13337
C  0.487637 3.687715 -0.584111
C  0.585564 3.459675 1.806429
C  1.138969 3.945173 0.624619
C  -0.598354 -2.780686 -1.3795
C  -2.166395 -4.228469 -0.297546
C  0.45248 -3.454513 -0.774481
C  -1.123659 -4.92922 0.291116
C  0.174943 -4.526542 0.059964
C  3.078547 4.870986 1.694551
C  3.906688 3.654808 2.05009
C  2.130221 -1.811849 -0.910408
C  3.105051 -1.374211 -1.795401
C  1.594523 -0.947985 0.037459
C  3.543433 -0.058846 -1.731661
C  2.032752 0.367492 0.079936
C  3.004473 0.820484 -0.802695
H  -2.018902 0.250349 -1.572781
H  -1.461314 -0.585309 -0.146931
H  -4.335645 -0.686758 -1.219052
H  -3.762949 -1.560674 0.18334
H  -2.48479 0.192857 2.6792
H  -3.479873 1.634271 2.877938
H  -4.1720 0.177459 2.187939
H  -3.981501 2.655532 -1.300064
H  -5.124906 1.715136 -0.350245
H  -4.465097 3.210907 0.29787
H  -3.920519 -2.972805 -1.853779
H  -2.772306 -1.93444 -2.67985
H  -1.148046 2.764892 -1.563255
H  -0.989408 2.355849 2.702815
H  0.911575 4.064918 -1.507266
H  1.052621 3.635209 2.766297
H  -0.382419 -1.950312 -2.041899
H  -3.18595 -4.536377 -0.100174
H  -1.317235 -5.775104 0.938465
H  2.472348 5.202209 2.542864
H  3.734559 5.702063 1.434549
H  4.538737 3.888671 2.907995
H  3.297569 2.790945 2.317749
H  4.561127 3.370455 1.225226
H  3.516716 -2.058215 -2.527079
H  0.843224 -1.288055 0.739383
H  4.304335 0.279699 -2.423109
H  1.607733 1.040686 0.813854
H  3.338841 1.849221 -0.764504
elementType: Si F O C H
totalener: -1510.06907642 hartree
nucrepener: 2916.80439855 hartree
electener: -4426.87347497 hartree
oneelecener: -7863.70130053 hartree
twoeener: 3436.82782556 hartree
cpcmener: -0.02361762 hartree
kineticenergy: 1503.90832654 hartree
xcener: -135.232388346396 hartree
chargesum: 0.0000000
charge: 0.504910 -0.217864 -0.334966 -0.334835 -0.229496 -0.141687 -0.189618 -0.448537 -0.424021 -0.100431 -0.083000 -0.134228 0.068928 -0.327804 -0.232061 0.350569 -0.250936 -0.219368 0.215168 -0.163659 0.180046 0.046467 -0.272579 0.299726 -0.249927 -0.224156 -0.120834 -0.119910 -0.192597 0.088246 0.059447 0.081485 0.080189 0.106806 0.106675 0.107491 0.103253 0.100539 0.105421 0.090545 0.088623 0.130407 0.138781 0.130214 0.134994 0.154120 0.141321 0.147563 0.086297 0.108605 0.103175 0.088062 0.089586 0.144935 0.157433 0.156074 0.164979 0.151433
qa: 0.5049 -0.2179 -0.3350 -0.3348 -0.2295 -0.1417 -0.1896 -0.4485 -0.4240 -0.1004 -0.0830 -0.1342 0.0689 -0.3278 -0.2321 0.3506 -0.2509 -0.2194 0.2152 -0.1637 0.1800 0.0465 -0.2726 0.2997 -0.2499 -0.2242 -0.1208 -0.1199 -0.1926 0.0882 0.0594 0.0815 0.0802 0.1068 0.1067 0.1075 0.1033 0.1005 0.1054 0.0905 0.0886 0.1304 0.1388 0.1302 0.1350 0.1541 0.1413 0.1476 0.0863 0.1086 0.1032 0.0881 0.0896 0.1449 0.1574 0.1561 0.1650 0.1514
va: 4.1101 1.0687 2.0592 2.0805 3.8241 3.9236 3.7791 3.9235 3.8956 3.8576 3.8241 3.8364 3.5991 4.0323 3.8695 3.6492 3.9062 3.9180 3.6725 3.8742 4.0776 3.8591 3.9093 3.6848 4.0160 3.9405 3.9379 3.8053 3.8870 1.0143 1.0288 1.0085 1.0030 1.0062 1.0084 1.0090 1.0080 1.0081 1.0093 1.0077 1.0093 0.9946 0.9914 1.0172 1.0094 0.9989 1.0021 0.9980 0.9962 0.9920 1.0120 1.0008 1.0029 1.0070 0.9984 0.9898 0.9807 0.9980
dispcorr: -0.033191000 hartree
energy: -1510.102267423403
dipole: -14.82089 14.03683 -0.78406 26.58464 -25.60457 0.98008 5.59463 -5.09574 0.49889
magnitude: 1.35063 au
magnitude: 3.43303 debye
