program: Orca
programVersion: 5.0.2
elementType: Si F O O C C C C C C C C C C C C C C C C C C C C C C C C C H H H H H H H H H H H H H H H H H H H H H H H H H H H H H
charge: 0
multiplicity: 1
keywords: wb97x-d3
keywords: def2-TZVPP
keywords: def2/J RIJCOSX
keywords: DEFGRID2
keywords: scfconv7
keywords: smallprint printgap noloewdin
keywords: NOSOSCF
formula: C25H29FO2Si
InChI: InChI=1/C25H29FO2Si/c1-4-27-21-13-15-23(16-14-21)29(2,3)18-8-9-20-12-17-24(26)25(19-20)28-22-10-6-5-7-11-22/h5-7,10-17,19H,4,8-9,18H2,1-3H3
58 atoms
Si -3.523078 1.303253 0.893286
F  0.462454 -3.228504 -3.770875
O  2.012983 3.699268 0.499232
O  1.939101 -2.827325 -1.615688
C  -3.285652 -0.538405 0.544046
C  -2.342315 -1.2470 1.51217
C  -1.832459 2.124246 0.802707
C  -4.267841 1.570966 2.600258
C  -4.653142 2.025396 -0.429121
C  -2.118259 -2.730863 1.190886
C  -1.287578 2.853638 1.855976
C  -1.037162 1.97857 -0.341889
C  -1.435467 -2.930967 -0.13187
C  -0.011631 3.406531 1.798772
C  0.230413 2.521398 -0.425485
C  0.759434 3.233628 0.65385
C  -0.052266 -2.788116 -0.227048
C  -2.161803 -3.20365 -1.286732
C  0.590534 -2.88984 -1.451473
C  -1.52957 -3.311929 -2.518085
C  -0.165703 -3.140474 -2.58943
C  2.655346 4.342421 1.592277
C  4.068023 4.66512 1.173664
C  2.701124 -1.979981 -0.857112
C  3.939029 -2.454055 -0.446169
C  2.302651 -0.682359 -0.561053
C  4.787478 -1.618959 0.266239
C  3.158997 0.138109 0.158721
C  4.400577 -0.322675 0.575866
H  -4.266583 -1.028391 0.552641
H  -2.918732 -0.636369 -0.483886
H  -2.736309 -1.177111 2.530417
H  -1.370883 -0.742325 1.529162
H  -4.464248 2.626356 2.801008
H  -5.222922 1.046915 2.685645
H  -3.624979 1.198339 3.400195
H  -4.234729 1.893224 -1.429562
H  -5.633712 1.543406 -0.422843
H  -4.814652 3.095458 -0.282447
H  -1.517094 -3.178454 1.986599
H  -3.080061 -3.250217 1.193589
H  -1.858292 3.00176 2.76587
H  -1.406516 1.420141 -1.196122
H  0.359499 3.958586 2.651943
H  0.826412 2.392412 -1.321284
H  0.528083 -2.598299 0.668794
H  -3.235521 -3.331269 -1.231274
H  -2.094421 -3.518587 -3.418269
H  2.659184 3.685377 2.468563
H  2.117248 5.256562 1.864904
H  4.089702 5.336631 0.314672
H  4.58596 5.159254 1.995735
H  4.626431 3.762124 0.922841
H  4.236117 -3.467111 -0.688364
H  1.340863 -0.30627 -0.888451
H  5.753488 -1.990055 0.584142
H  2.857033 1.153104 0.381426
H  5.062013 0.326967 1.134107
elementType: Si F O C H
totalener: -1510.07207495 hartree
nucrepener: 2885.06914719 hartree
electener: -4395.14122214 hartree
oneelecener: -7800.26217497 hartree
twoeener: 3405.12095283 hartree
cpcmener: -0.02280450 hartree
kineticenergy: 1503.91264337 hartree
xcener: -135.229722118768 hartree
chargesum: -0.0000000
charge: 0.493518 -0.218365 -0.330892 -0.327715 -0.268698 -0.127437 -0.178274 -0.451047 -0.422515 -0.097830 -0.136222 -0.091534 0.052784 -0.242529 -0.323436 0.358781 -0.220125 -0.245777 0.215268 -0.139154 0.165718 0.045126 -0.271919 0.306006 -0.264020 -0.237147 -0.090069 -0.061386 -0.249310 0.087559 0.081877 0.086348 0.077307 0.108075 0.110839 0.102387 0.100393 0.102009 0.101834 0.094953 0.085596 0.142131 0.133175 0.137033 0.137967 0.143727 0.142956 0.148177 0.097176 0.107884 0.088140 0.090279 0.085482 0.144438 0.150010 0.156895 0.161005 0.152549
qa: 0.4935 -0.2184 -0.3309 -0.3277 -0.2687 -0.1274 -0.1783 -0.4510 -0.4225 -0.0978 -0.1362 -0.0915 0.0528 -0.2425 -0.3234 0.3588 -0.2201 -0.2458 0.2153 -0.1392 0.1657 0.0451 -0.2719 0.3060 -0.2640 -0.2371 -0.0901 -0.0614 -0.2493 0.0876 0.0819 0.0863 0.0773 0.1081 0.1108 0.1024 0.1004 0.1020 0.1018 0.0950 0.0856 0.1421 0.1332 0.1370 0.1380 0.1437 0.1430 0.1482 0.0972 0.1079 0.0881 0.0903 0.0855 0.1444 0.1500 0.1569 0.1610 0.1525
va: 4.1408 1.0666 2.0711 2.0827 3.8374 3.8599 3.7610 3.9215 3.8950 3.8546 3.8920 3.8266 3.6170 3.9077 4.0036 3.7039 3.9175 3.8840 3.6840 3.8654 4.0668 3.7937 3.9765 3.7289 4.0159 3.9514 3.8602 3.7901 3.9866 1.0159 1.0142 1.0080 1.0064 1.0083 1.0077 1.0066 1.0094 1.0086 1.0088 1.0074 1.0091 0.9898 0.9925 1.0122 1.0117 1.0055 1.0020 0.9974 0.9874 0.9871 1.0038 1.0061 1.0023 1.0084 1.0036 0.9887 0.9775 0.9955
dispcorr: -0.030669282 hartree
energy: -1510.102744236534
dipole: -12.80910 12.41432 -0.39477 23.27220 -22.44152 0.83068 23.29746 -21.38194 1.91552
magnitude: 2.12488 au
magnitude: 5.40101 debye
