program: Orca
programVersion: 5.0.2
elementType: Si F O O C C C C C C C C C C C C C C C C C C C C C C C C C H H H H H H H H H H H H H H H H H H H H H H H H H H H H H
charge: 0
multiplicity: 1
keywords: wb97x-d3
keywords: def2-TZVPP
keywords: def2/J RIJCOSX
keywords: DEFGRID2
keywords: scfconv7
keywords: smallprint printgap noloewdin
keywords: NOSOSCF
formula: C25H29FO2Si
InChI: InChI=1/C25H29FO2Si/c1-4-27-21-13-15-23(16-14-21)29(2,3)18-8-9-20-12-17-24(26)25(19-20)28-22-10-6-5-7-11-22/h5-7,10-17,19H,4,8-9,18H2,1-3H3
58 atoms
Si -3.31545 -0.373319 1.326548
F  2.973983 0.345154 -1.982791
O  1.548237 3.174383 1.947113
O  1.674516 -2.011187 -2.372858
C  -3.019753 -1.530709 -0.143257
C  -3.352596 -0.998088 -1.538843
C  -1.847545 0.786551 1.533249
C  -3.440825 -1.441863 2.874642
C  -4.898295 0.619553 1.102706
C  -2.655872 0.295631 -1.952156
C  -1.955007 2.173383 1.475506
C  -0.563327 0.264303 1.733342
C  -1.149343 0.282591 -1.954721
C  -0.852936 3.013584 1.60283
C  0.54712 1.076556 1.861195
C  0.412227 2.465917 1.795543
C  -0.415691 -0.886058 -2.14166
C  -0.450961 1.475667 -1.78316
C  0.968902 -0.861359 -2.153818
C  0.935166 1.514968 -1.797148
C  1.633758 0.341971 -1.980943
C  1.541235 4.586012 1.776368
C  1.492026 5.005225 0.32228
C  2.346521 -2.581902 -1.327614
C  2.143997 -2.222332 -0.001562
C  3.250301 -3.58553 -1.656813
C  2.865034 -2.869881 0.994043
C  3.958331 -4.22343 -0.651103
C  3.774817 -3.867735 0.6796
H  -1.980172 -1.872963 -0.095646
H  -3.618976 -2.431473 0.03087
H  -4.429139 -0.817901 -1.603953
H  -3.148049 -1.774534 -2.282991
H  -2.53533 -2.033693 3.028795
H  -3.587565 -0.835779 3.771125
H  -4.276849 -2.142421 2.812987
H  -4.863722 1.285082 0.237907
H  -5.753388 -0.045985 0.963356
H  -5.113657 1.234034 1.979705
H  -3.00099 0.558669 -2.95782
H  -2.989659 1.117446 -1.312491
H  -2.922984 2.637003 1.320729
H  -0.414468 -0.809465 1.789436
H  -1.005818 4.083055 1.546955
H  1.529373 0.6442 2.013093
H  -0.910259 -1.839798 -2.28111
H  -0.998346 2.397721 -1.631196
H  1.468321 2.447366 -1.66104
H  2.474665 4.924356 2.226768
H  0.730202 5.044663 2.350214
H  0.564059 4.713762 -0.1703
H  1.5692 6.09159 0.258804
H  2.327462 4.580811 -0.23583
H  1.432469 -1.452971 0.270527
H  3.395658 -3.860525 -2.694144
H  2.705749 -2.583939 2.026046
H  4.66323 -5.002076 -0.912793
H  4.335123 -4.363791 1.461034
elementType: Si F O C H
totalener: -1510.06672824 hartree
nucrepener: 3002.39607142 hartree
electener: -4512.46279967 hartree
oneelecener: -8035.26736412 hartree
twoeener: 3522.80456445 hartree
cpcmener: -0.02501611 hartree
kineticenergy: 1503.90642026 hartree
xcener: -135.235332085960 hartree
chargesum: -0.0000000
charge: 0.476315 -0.217214 -0.331374 -0.329338 -0.270988 -0.145029 -0.098045 -0.451783 -0.439077 -0.076580 -0.167884 -0.118953 0.026924 -0.221538 -0.312398 0.343064 -0.215206 -0.190983 0.159000 -0.193567 0.268776 0.050645 -0.274738 0.267039 -0.124931 -0.223779 -0.194868 -0.135813 -0.169781 0.083840 0.096255 0.089874 0.085433 0.099692 0.099777 0.100715 0.104393 0.112368 0.110931 0.100594 0.076820 0.142321 0.133479 0.135247 0.127133 0.135549 0.141717 0.147885 0.108315 0.084178 0.088624 0.100779 0.088955 0.106034 0.143260 0.155544 0.155702 0.156693
qa: 0.4763 -0.2172 -0.3314 -0.3293 -0.2710 -0.1450 -0.0980 -0.4518 -0.4391 -0.0766 -0.1679 -0.1190 0.0269 -0.2215 -0.3124 0.3431 -0.2152 -0.1910 0.1590 -0.1936 0.2688 0.0506 -0.2747 0.2670 -0.1249 -0.2238 -0.1949 -0.1358 -0.1698 0.0838 0.0963 0.0899 0.0854 0.0997 0.0998 0.1007 0.1044 0.1124 0.1109 0.1006 0.0768 0.1423 0.1335 0.1352 0.1271 0.1355 0.1417 0.1479 0.1083 0.0842 0.0886 0.1008 0.0890 0.1060 0.1433 0.1555 0.1557 0.1567
va: 4.1012 1.0712 2.0692 2.0803 3.8364 3.8977 3.6666 3.9014 3.9127 3.8210 3.8488 3.8376 3.6331 3.8381 3.9744 3.7026 3.9411 3.8601 3.7561 3.8573 4.0024 3.8544 3.9123 3.7192 3.8186 3.9708 3.9440 3.9125 3.8909 1.0116 1.0101 0.9986 1.0007 1.0108 1.0106 1.0116 1.0074 1.0091 1.0090 1.0019 1.0098 0.9898 0.9862 1.0077 1.0184 1.0121 0.9995 0.9987 0.9919 0.9961 1.0006 1.0123 1.0051 1.0291 1.0100 0.9931 0.9896 0.9904
dispcorr: -0.035274776 hartree
energy: -1510.102003019035
dipole: -25.72803 24.40159 -1.32644 8.31605 -7.16874 1.14731 12.19856 -11.92501 0.27354
magnitude: 1.77499 au
magnitude: 4.51166 debye
