program: Orca
programVersion: 5.0.2
elementType: Si F O O C C C C C C C C C C C C C C C C C C C C C C C C C H H H H H H H H H H H H H H H H H H H H H H H H H H H H H
charge: 0
multiplicity: 1
keywords: wb97x-d3
keywords: def2-TZVPP
keywords: def2/J RIJCOSX
keywords: DEFGRID2
keywords: scfconv7
keywords: smallprint printgap noloewdin
keywords: NOSOSCF
formula: C25H29FO2Si
InChI: InChI=1/C25H29FO2Si/c1-4-27-21-13-15-23(16-14-21)29(2,3)18-8-9-20-12-17-24(26)25(19-20)28-22-10-6-5-7-11-22/h5-7,10-17,19H,4,8-9,18H2,1-3H3
58 atoms
Si -3.139208 1.357125 0.729648
F  1.806055 -4.383552 0.079449
O  2.001144 2.821452 -2.106847
O  2.00156 -1.7176 -0.231413
C  -3.27094 -0.51754 0.998749
C  -3.769792 -1.357885 -0.178101
C  -1.54172 1.853572 -0.13402
C  -3.164935 2.168537 2.430424
C  -4.595246 1.955716 -0.303647
C  -2.793654 -1.48183 -1.352586
C  -1.472687 2.066905 -1.515924
C  -0.355106 2.003089 0.581254
C  -1.549539 -2.249549 -1.000887
C  -0.286855 2.388059 -2.149587
C  0.850556 2.327479 -0.030658
C  0.891466 2.514661 -1.410391
C  -0.335489 -1.606265 -0.785376
C  -1.600802 -3.635809 -0.855799
C  0.793005 -2.326325 -0.419558
C  -0.477898 -4.366489 -0.501795
C  0.709663 -3.700261 -0.275954
C  3.243747 2.9093 -1.421741
C  4.323212 3.171494 -2.441906
C  2.206696 -0.976649 0.897095
C  3.396508 -0.257843 0.943155
C  1.309902 -0.920966 1.955925
C  3.675493 0.534956 2.044377
C  1.603923 -0.118012 3.051327
C  2.777917 0.617984 3.102373
H  -2.312862 -0.900099 1.369038
H  -3.968043 -0.648635 1.834696
H  -4.707539 -0.94059 -0.555801
H  -4.016958 -2.365968 0.170734
H  -3.021901 3.24924 2.367845
H  -4.118739 1.994064 2.933827
H  -2.383723 1.772947 3.083605
H  -4.574438 3.041057 -0.425458
H  -4.608025 1.518832 -1.304349
H  -5.546679 1.702089 0.169496
H  -3.306271 -1.989907 -2.173591
H  -2.523551 -0.492115 -1.727284
H  -2.36555 1.980666 -2.125334
H  -0.347647 1.866652 1.656972
H  -0.261981 2.545071 -3.221488
H  1.736465 2.430902 0.581788
H  -0.25744 -0.530703 -0.901413
H  -2.533062 -4.15952 -1.030157
H  -0.523516 -5.443051 -0.397425
H  3.446434 1.976177 -0.886094
H  3.212339 3.715365 -0.680627
H  4.156851 4.109328 -2.973152
H  5.287172 3.241512 -1.937574
H  4.387447 2.364717 -3.172862
H  4.094494 -0.319463 0.11734
H  0.385224 -1.483237 1.942385
H  4.601016 1.095772 2.071046
H  0.897943 -0.072121 3.870877
H  2.995711 1.243216 3.958091
elementType: Si F O C H
totalener: -1510.06975433 hartree
nucrepener: 3015.31810922 hartree
electener: -4525.38786354 hartree
oneelecener: -8060.77610718 hartree
twoeener: 3535.38824364 hartree
cpcmener: -0.02227752 hartree
kineticenergy: 1503.90713584 hartree
xcener: -135.234123402642 hartree
chargesum: -0.0000000
charge: 0.468837 -0.216962 -0.325938 -0.328563 -0.261248 -0.151910 -0.141307 -0.459175 -0.434021 -0.107571 -0.099025 -0.160027 -0.027285 -0.275259 -0.295103 0.374786 -0.135225 -0.158023 0.163250 -0.210160 0.253135 0.074758 -0.278222 0.359048 -0.271911 -0.203292 -0.128629 -0.195886 -0.166834 0.071422 0.098792 0.085798 0.092563 0.103807 0.104474 0.100388 0.114082 0.099836 0.111508 0.101424 0.092789 0.143344 0.144725 0.131293 0.140342 0.103287 0.143500 0.146667 0.079625 0.096266 0.089992 0.089453 0.087556 0.145416 0.149786 0.154934 0.158788 0.155905
qa: 0.4688 -0.2170 -0.3259 -0.3286 -0.2612 -0.1519 -0.1413 -0.4592 -0.4340 -0.1076 -0.0990 -0.1600 -0.0273 -0.2753 -0.2951 0.3748 -0.1352 -0.1580 0.1632 -0.2102 0.2531 0.0748 -0.2782 0.3590 -0.2719 -0.2033 -0.1286 -0.1959 -0.1668 0.0714 0.0988 0.0858 0.0926 0.1038 0.1045 0.1004 0.1141 0.0998 0.1115 0.1014 0.0928 0.1433 0.1447 0.1313 0.1403 0.1033 0.1435 0.1467 0.0796 0.0963 0.0900 0.0895 0.0876 0.1454 0.1498 0.1549 0.1588 0.1559
va: 4.1267 1.0716 2.0957 2.0870 3.8242 3.8929 3.6711 3.9140 3.9033 3.8107 3.8212 3.8594 3.6679 4.0440 3.8561 3.7431 3.8556 3.8725 3.7062 3.9245 4.0233 3.7999 3.9794 3.5775 3.9287 3.8206 3.8587 3.8836 3.8775 1.0216 1.0062 1.0013 1.0022 1.0104 1.0106 1.0110 1.0087 1.0066 1.0063 1.0084 1.0118 0.9842 0.9820 1.0149 1.0124 1.0190 0.9992 0.9995 0.9825 0.9870 1.0043 1.0054 1.0037 1.0079 1.0073 0.9899 0.9915 0.9899
dispcorr: -0.035671365 hartree
energy: -1510.105425693215
dipole: -16.65656 15.91957 -0.73699 22.90552 -22.45697 0.44855 2.17758 -1.63459 0.54299
magnitude: 1.01940 au
magnitude: 2.59112 debye
