program: Orca
programVersion: 5.0.2
elementType: Si F O O C C C C C C C C C C C C C C C C C C C C C C C C C H H H H H H H H H H H H H H H H H H H H H H H H H H H H H
charge: 0
multiplicity: 1
keywords: wb97x-d3
keywords: def2-TZVPP
keywords: def2/J RIJCOSX
keywords: DEFGRID2
keywords: scfconv7
keywords: smallprint printgap noloewdin
keywords: NOSOSCF
formula: C25H29FO2Si
InChI: InChI=1/C25H29FO2Si/c1-4-27-21-13-15-23(16-14-21)29(2,3)18-8-9-20-12-17-24(26)25(19-20)28-22-10-6-5-7-11-22/h5-7,10-17,19H,4,8-9,18H2,1-3H3
58 atoms
Si -2.976785 1.229312 0.732207
F  1.188272 -3.14294 -3.377927
O  2.098018 4.52802 0.540203
O  1.897423 -2.836869 -0.82671
C  -2.362847 -0.556297 0.754751
C  -3.411815 -1.644064 0.543589
C  -1.434665 2.308443 0.65362
C  -3.980772 1.636649 2.269195
C  -4.017004 1.512417 -0.812544
C  -2.829007 -3.067602 0.538769
C  -0.996232 3.098311 1.720279
C  -0.629668 2.297309 -0.487028
C  -1.752842 -3.217076 -0.497813
C  0.181505 3.823996 1.658394
C  0.555475 3.015916 -0.574149
C  0.973747 3.78544 0.510186
C  -0.417535 -3.041671 -0.14783
C  -2.07045 -3.41801 -1.838532
C  0.576944 -3.005767 -1.114085
C  -1.082064 -3.415757 -2.812132
C  0.227236 -3.188705 -2.443888
C  3.073036 4.390135 -0.486717
C  3.868527 3.106434 -0.379365
C  2.284074 -1.924547 0.118448
C  3.431744 -2.226418 0.838813
C  1.608179 -0.729451 0.333435
C  3.900891 -1.32662 1.784799
C  2.078479 0.151608 1.29688
C  3.223168 -0.139478 2.026292
H  -1.606107 -0.61976 -0.034584
H  -1.819943 -0.727554 1.692018
H  -3.93304 -1.476926 -0.404128
H  -4.177026 -1.5928 1.323819
H  -4.869789 1.00426 2.327048
H  -3.413056 1.475202 3.187935
H  -4.324984 2.673019 2.270622
H  -3.485108 1.218522 -1.720335
H  -4.944144 0.935547 -0.781571
H  -4.293888 2.56309 -0.922285
H  -2.424534 -3.29406 1.528614
H  -3.634703 -3.782629 0.354516
H  -1.579655 3.153911 2.632517
H  -0.918659 1.706174 -1.350043
H  0.499229 4.425091 2.502242
H  1.134694 2.95751 -1.486069
H  -0.153691 -2.902339 0.893985
H  -3.101528 -3.569831 -2.133594
H  -1.327457 -3.56986 -3.85528
H  3.733657 5.247304 -0.355982
H  2.616426 4.492113 -1.475911
H  4.330029 3.01064 0.604226
H  3.266072 2.216865 -0.563333
H  4.667995 3.118033 -1.121792
H  3.954171 -3.157346 0.656552
H  0.722013 -0.477244 -0.2348
H  4.7981 -1.563997 2.341946
H  1.542636 1.076554 1.470065
H  3.58406 0.554542 2.773905
elementType: Si F O C H
totalener: -1510.06774823 hartree
nucrepener: 2936.87821164 hartree
electener: -4446.94595987 hartree
oneelecener: -7903.62606554 hartree
twoeener: 3456.68010567 hartree
cpcmener: -0.02251621 hartree
kineticenergy: 1503.91028044 hartree
xcener: -135.233888082442 hartree
chargesum: -0.0000000
charge: 0.502286 -0.218205 -0.333631 -0.330646 -0.216614 -0.160193 -0.141931 -0.448223 -0.432666 -0.093105 -0.102998 -0.200392 0.054494 -0.253358 -0.239227 0.306676 -0.249135 -0.216393 0.235037 -0.164964 0.176384 0.044590 -0.257764 0.307563 -0.261932 -0.206278 -0.097834 -0.129109 -0.225538 0.058011 0.090244 0.082257 0.082631 0.106153 0.102426 0.108868 0.105656 0.104454 0.110282 0.084799 0.092749 0.137742 0.138379 0.131034 0.138793 0.146533 0.142862 0.147671 0.107413 0.084706 0.088023 0.081940 0.099115 0.144649 0.177288 0.156446 0.149389 0.152595
qa: 0.5023 -0.2182 -0.3336 -0.3306 -0.2166 -0.1602 -0.1419 -0.4482 -0.4327 -0.0931 -0.1030 -0.2004 0.0545 -0.2534 -0.2392 0.3067 -0.2491 -0.2164 0.2350 -0.1650 0.1764 0.0446 -0.2578 0.3076 -0.2619 -0.2063 -0.0978 -0.1291 -0.2255 0.0580 0.0902 0.0823 0.0826 0.1062 0.1024 0.1089 0.1057 0.1045 0.1103 0.0848 0.0927 0.1377 0.1384 0.1310 0.1388 0.1465 0.1429 0.1477 0.1074 0.0847 0.0880 0.0819 0.0991 0.1446 0.1773 0.1564 0.1494 0.1526
va: 4.1055 1.0674 2.0724 2.0919 3.8074 3.9195 3.7234 3.9258 3.8829 3.8518 3.8657 3.8812 3.6043 4.0168 3.8321 3.7344 3.9156 3.9108 3.6542 3.8803 4.0698 3.8708 3.9121 3.7485 4.0081 3.8475 3.8664 3.7829 3.9530 1.0297 1.0144 1.0009 1.0115 1.0103 1.0090 1.0078 1.0074 1.0060 1.0090 1.0108 1.0080 0.9894 0.9955 1.0153 1.0071 1.0028 1.0015 0.9982 0.9913 0.9947 1.0069 0.9981 1.0116 1.0082 0.9798 0.9880 1.0007 0.9950
dispcorr: -0.033355443 hartree
energy: -1510.101103671904
dipole: -15.06777 14.42376 -0.64401 17.29961 -17.11501 0.18461 12.35442 -12.02630 0.32812
magnitude: 0.74598 au
magnitude: 1.89614 debye
