program: Gaussian 09
title: 000063712
version: EM64L-G09RevD.01
frameworkgroup: C1[X(C14H14N4OS)]
method: RPBEPBE
basis: SDD
operation: Freq
keyword: #p
keyword: freq=noraman
keyword: PBEPBE/SDD
title: #p freq=noraman PBEPBE/SDD
converged: NO YES NO NO
title: Mulliken charges:
elementType: S O N N N N C C C C C C C C C C C C C C H H H H H H H H H H H H H H
charge: 0.310118 -0.223211 -0.247572 -0.034779 -0.068405 -0.007173 -0.139214 -0.099888 0.163502 0.141272 -0.175084 0.144314 0.057967 -0.672051 -0.658036 -0.313888 -0.757986 -0.346667 -0.242537 -0.201877 0.224799 0.239708 0.210560 0.224415 0.226322 0.223430 0.233582 0.272203 0.277513 0.236612 0.265656 0.263553 0.236569 0.236274
chargesum: 0.00000
title: Mulliken charges with hydrogens summed into heavy atoms:
elementType: S O N N N N C C C C C C C C C C C C C C
charge: 0.310118 -0.223211 -0.247572 -0.034779 -0.068405 -0.007173 0.085585 -0.099888 0.163502 0.141272 -0.175084 0.144314 0.057967 0.002633 0.025298 -0.041685 0.021795 -0.083114 -0.005969 0.034397
polarizability: 3.29503716e+02 8.22314395e+00 1.85999772e+02 -2.03426327e+00 -3.01956133e+00 1.15452638e+02
1716.lowfreq: -4.5600 -2.8006 -0.0011 -0.0004 0.0008 6.5589 27.4453 30.1416 35.8129
frequency: 26.5619 30.0238 35.8075 44.9491 101.2995 113.0711 122.8210 157.2143 181.5935 195.3360 197.7432 213.9684 237.6052 262.2916 280.6046 297.6205 309.9947 343.1652 386.4956 405.5616 431.7891 441.7629 453.6154 517.7459 519.3209 535.0239 564.6169 592.7038 618.7555 626.6536 633.8222 644.3373 656.2771 688.2192 703.1246 784.8006 795.2662 814.2390 845.9899 867.2297 899.3820 925.8581 949.3346 960.3577 978.3619 981.3099 998.0674 1004.8863 1021.5964 1027.4140 1049.5024 1070.9328 1096.7926 1103.1423 1114.4469 1164.6376 1170.4442 1194.5223 1216.3450 1233.7726 1273.7422 1285.4815 1294.9112 1336.5555 1380.4759 1392.0469 1395.7347 1397.8145 1427.3085 1440.3010 1452.7641 1457.6648 1459.1894 1460.9779 1461.8539 1468.1637 1475.0740 1491.1680 1565.7419 1578.9168 1615.2917 1631.8388 2986.8662 2990.7454 2996.1246 2997.1625 3080.9197 3087.7782 3093.2664 3094.5113 3107.0684 3137.8060 3138.8238 3152.1831 3167.0712 3176.4576
redmass: 3.1054 5.7876 7.7628 4.7960 4.0909 5.4104 4.3010 4.2384 3.3542 1.0688 1.1107 3.9946 1.5137 3.4882 3.4507 4.3425 3.8062 4.6419 6.1471 3.7697 4.0072 5.7554 4.7367 5.0276 4.3937 9.2315 7.6355 7.4357 8.5329 4.9506 5.5942 4.0070 6.4954 5.1653 6.2189 1.5989 3.1086 7.8889 4.9289 3.0761 1.5059 1.1760 8.6034 1.4400 6.0156 1.3764 2.8116 1.3372 2.3780 2.7459 1.5575 3.0283 1.8601 1.9058 2.5381 1.2300 1.9052 3.3773 3.1122 2.8101 3.6447 1.3280 2.1785 1.5861 1.1887 9.7924 1.3014 1.2372 5.3531 3.6170 1.3513 2.2780 2.5132 1.0475 1.0951 1.0514 1.0446 1.1218 6.8893 8.0059 7.3122 10.3032 1.0348 1.0792 1.0392 1.0391 1.0959 1.1008 1.1004 1.1012 1.1001 1.0864 1.0993 1.0903 1.0957 1.0998
irintensity: 0.4392 2.4654 2.0823 0.1897 4.3090 0.3431 0.2816 0.5169 1.5393 0.3315 0.2513 2.8998 0.3845 1.9951 6.5567 1.4014 1.0891 3.6463 1.4013 7.1732 2.1863 0.9342 2.6821 0.9329 3.6809 3.0594 1.2971 17.3519 0.8281 10.2414 6.1913 20.0385 14.6106 13.8540 30.6873 73.9612 6.3209 12.7188 8.0607 0.7386 0.8807 4.0523 18.3497 1.8050 21.4787 3.3279 17.0305 0.0048 37.7242 49.4574 3.7509 33.7707 13.8102 18.6073 1.9280 3.3204 10.9156 42.8752 45.8507 34.3366 120.3089 1.6704 143.7451 7.7660 21.1542 34.7588 10.1980 34.5560 139.0562 18.5756 63.4300 4.3136 31.4020 5.3683 32.4980 2.2884 19.4742 31.3339 1.4700 226.2806 149.0778 224.6385 25.7012 10.6141 31.8943 8.2433 5.1723 21.9116 46.2698 17.5586 29.2503 4.7101 7.5895 7.2247 10.2912 22.0205
temp: 298.150 k
press: 1.00000 atm
elementType: 16 8 7 7 7 7 6 6 6 6 6 6 6 6 6 6 6 6 6 6 1 1 1 1 1 1 1 1 1 1 1 1 1 1
symmnumber: 1
zpe: 674633.6 jmol-1
zpe.correction: 0.256954 hartree
zpe.thermalcorrener: 0.275384 hartree
zpe.thermalcorrenthalpy: 0.276328 hartree
zpe.thermalcorrgfe: 0.208890 hartree
zpe.sumelectzpe: -1232.744404 hartree
zpe.sumelectthermal: -1232.725975 hartree
zpe.sumelectthermalent: -1232.725031 hartree
zpe.sumelectthermalfe: -1232.792469 hartree
dipole: 0.3386 0.0712 2.7400
dipole: 2.7618
quadrupole: -93.2338 -124.7094 -130.1034
quadrupole: 1.0899 7.0689 2.4359
quadrupole: 22.7817 -8.6939 -14.0878 1.0899 7.0689 2.4359
hfenergy: -1233.0013589 hartree
pointgroup: C01 [X(C14H14N4O1S1)]
dipole: 0.1113713 -0.0988405 1.0763239 debye
polarizability: 329.6227073|6.7967658|185.5840622|3.1297128|5.348304|115.7493564 unknown
InChI: InChI=1S/C14H14N4OS/c1-8(2)12-16-17-14(20-12)18-9(3)15-11-7-5-4-6-10(11)13(18)19/h4-8H,1-3H3
charge 0 multiplicity 1
34 atoms
S  2.102191 -0.741685 1.102044
O  -0.457084 -1.962656 -0.525291
N  -0.306034 0.324618 0.016505
N  -2.251597 1.693114 0.394131
N  3.202026 0.711598 -0.846427
N  1.818006 0.904083 -0.985688
C  4.947195 -0.546122 0.473683
C  3.539056 -0.098671 0.157864
C  -2.516807 -0.708623 -0.192483
C  -0.940465 1.5674 0.33811
C  1.107397 0.243312 -0.075209
C  -1.058422 -0.887232 -0.259103
C  -3.065011 0.574115 0.125618
C  5.989695 0.460157 -0.069974
C  5.186082 -1.972935 -0.103865
C  -3.374028 -1.810408 -0.449269
C  -0.058916 2.754001 0.630363
C  -4.476107 0.73134 0.180844
C  -4.767156 -1.640801 -0.391809
C  -5.316034 -0.365751 -0.07597
H  5.04858 -0.603701 1.575914
H  5.904825 0.553817 -1.165331
H  7.006773 0.109646 0.180767
H  5.845833 1.464431 0.364837
H  4.454481 -2.701444 0.288348
H  6.200107 -2.31783 0.166432
H  5.103244 -1.957923 -1.20486
H  -2.920254 -2.777052 -0.690599
H  0.515241 3.055276 -0.262435
H  0.671781 2.530791 1.429551
H  -0.705927 3.582958 0.948967
H  -4.875019 1.720025 0.425769
H  -5.432359 -2.487392 -0.590672
H  -6.403292 -0.238956 -0.033058
