program: Gaussian 09
title: 000063736
version: EM64L-G09RevD.01
frameworkgroup: C1[X(C18H18ClN3OS)]
method: RPBEPBE
basis: SDD
operation: Freq
keyword: #p
keyword: freq=noraman
keyword: PBEPBE/SDD
title: #p freq=noraman PBEPBE/SDD
converged: YES YES NO NO
title: Mulliken charges:
elementType: Cl S O N N N C C C C C C C C C C C C C C C C C C H H H H H H H H H H H H H H H H H H
charge: -0.049011 0.241239 -0.226709 -0.296585 -0.089656 0.027491 -0.281356 -0.322223 0.149022 -0.616121 0.120491 0.111743 0.409240 -0.317028 -0.334858 -0.308197 -0.309445 -0.615169 -0.613920 -0.244681 -0.074957 -0.213564 -0.213049 -0.229919 0.195323 0.223027 0.292158 0.286031 0.276122 0.283316 0.248246 0.248052 0.228534 0.190507 0.225334 0.227087 0.190493 0.226446 0.261327 0.231606 0.231397 0.232214
chargesum: 0.00000
title: Mulliken charges with hydrogens summed into heavy atoms:
elementType: Cl S O N N N C C C C C C C C C C C C C C C C C C
charge: -0.049011 0.241239 -0.226709 -0.296585 -0.089656 0.027491 -0.281356 0.096127 0.149022 -0.037932 0.120491 0.111743 0.409240 -0.040906 -0.051541 -0.059951 -0.061393 0.029206 0.030106 0.016646 -0.074957 0.018042 0.018348 0.002295
polarizability: 3.37321757e+02 -3.97037106e+01 3.05455260e+02 2.52929082e+00 1.97739272e+00 1.52923693e+02
1716.lowfreq: -5.1932 -3.1585 -0.0024 -0.0014 -0.0005 3.7522 11.1609 18.9057 22.1022
frequency: 9.8797 18.7663 21.9883 29.2210 36.6781 58.7421 77.7810 88.1910 94.6344 97.0566 136.0977 141.7153 178.5572 190.7817 212.8471 220.1917 235.8268 244.2717 270.9836 288.6351 294.0624 317.3729 347.1399 361.2564 406.3789 413.3355 424.8873 431.9838 441.8386 458.7273 490.9720 541.6752 575.2042 578.2099 594.6772 612.3641 644.3055 649.6694 677.5122 688.9500 693.7712 695.9752 757.0998 774.6528 776.9397 815.2899 817.5453 837.7936 844.0809 889.2485 890.6517 916.1544 928.7660 975.0137 980.0200 990.0883 997.9895 1003.1360 1017.8082 1022.4579 1034.3566 1044.7860 1062.1733 1067.2584 1078.1351 1090.1848 1112.6924 1116.7522 1145.7209 1173.1870 1173.8098 1180.2556 1206.1071 1223.7219 1229.2102 1247.8249 1257.4778 1265.4231 1283.3933 1301.5121 1309.5324 1370.9428 1382.6966 1382.8278 1411.8734 1420.5523 1438.4426 1440.9185 1443.8531 1449.7709 1462.3465 1467.7769 1476.2208 1478.1440 1479.8985 1485.7665 1518.7351 1550.4684 1599.5209 1602.2925 1607.5839 1622.3296 2853.9870 2855.9781 2872.0642 3022.5841 3030.0416 3033.1824 3061.7189 3080.8910 3088.7693 3132.9135 3143.2294 3143.4199 3153.9743 3157.5940 3163.5011 3173.6877 3180.9784 3185.6253
redmass: 2.4678 4.3476 4.8111 7.5593 4.9328 5.8825 4.4501 2.0073 9.6326 5.1267 6.3270 5.1848 3.8797 6.1311 1.0898 2.5384 1.6982 7.6286 4.1038 6.4858 8.9113 5.5571 2.7261 7.5195 2.8067 4.0289 4.9053 4.3713 2.6072 4.1611 4.0055 10.9441 5.8641 6.6600 9.8581 6.3967 9.9941 6.1308 5.0128 6.3591 6.8841 1.9186 1.9900 1.1721 3.2774 4.6688 4.5367 1.5886 1.2485 5.7728 1.5344 3.7244 1.9613 1.3896 1.3377 6.2338 1.3286 1.3715 3.0898 2.4492 1.5868 3.4057 1.9480 2.6295 1.5260 1.2862 1.8197 1.2845 1.5545 3.3039 1.0564 1.3262 2.2892 1.6941 3.2918 1.4036 1.5983 2.4507 5.2066 1.3026 1.3198 1.3545 9.9509 9.9607 4.9835 1.1391 2.2043 1.1141 1.1502 2.7070 1.0503 1.0596 1.0528 2.3514 1.0928 1.0550 10.6051 8.6789 6.6146 7.6970 6.4198 11.2836 1.0598 1.0631 1.0605 1.0732 1.0837 1.0780 1.0573 1.1010 1.1004 1.0852 1.0892 1.1081 1.0931 1.0892 1.0974 1.1017 1.0964 1.0938
irintensity: 0.4739 0.0066 0.0057 0.4976 0.2071 0.4975 0.8449 3.4408 1.8964 0.0477 1.4985 0.9811 1.3224 1.3077 1.3301 1.1616 0.0512 0.0495 3.0790 0.3521 2.0648 6.6514 6.6114 5.5841 0.0036 8.5906 2.7713 22.9026 1.9682 3.2861 15.3216 7.8664 1.9108 6.6095 23.9853 1.1857 0.0151 2.4414 12.7687 16.4538 19.1750 60.0037 45.8743 4.5563 15.9769 18.6856 10.3875 29.4389 0.0223 63.9290 20.8581 21.7844 15.9431 0.0065 0.8166 4.8139 0.2708 0.7304 2.8486 38.8705 27.5033 24.7052 30.6826 25.0568 10.9316 4.3429 16.7669 31.1755 8.9421 163.9411 0.3657 33.2768 9.6118 9.0463 53.7506 7.3987 0.1056 4.1412 78.7586 4.2623 0.0205 3.2152 2.6709 39.5272 20.8375 2.8670 7.1870 24.0986 9.4794 204.3022 15.8922 7.1534 17.1945 50.6186 15.2495 11.0464 613.1525 26.9813 2.6702 290.8211 8.5387 241.5432 75.3968 54.1956 227.9257 42.1490 30.9481 23.0175 5.8697 27.0087 46.9084 0.0484 2.6586 11.6184 26.7380 1.1731 17.3482 12.4551 1.8602 0.2164
temp: 298.150 k
press: 1.00000 atm
elementType: 17 16 8 7 7 7 6 6 6 6 6 6 6 6 6 6 6 6 6 6 6 6 6 6 1 1 1 1 1 1 1 1 1 1 1 1 1 1 1 1 1 1
symmnumber: 1
zpe: 844913.3 jmol-1
zpe.correction: 0.321810 hartree
zpe.thermalcorrener: 0.345015 hartree
zpe.thermalcorrenthalpy: 0.345959 hartree
zpe.thermalcorrgfe: 0.264343 hartree
zpe.sumelectzpe: -1792.590159 hartree
zpe.sumelectthermal: -1792.566954 hartree
zpe.sumelectthermalent: -1792.566010 hartree
zpe.sumelectthermalfe: -1792.647626 hartree
dipole: -4.3123 -0.6557 0.4943
dipole: 4.3897
quadrupole: -144.9979 -152.7672 -149.9175
quadrupole: 0.4892 -0.7429 -3.5214
quadrupole: 4.2296 -3.5397 -0.6900 0.4892 -0.7429 -3.5214
hfenergy: -1792.9119691 hartree
pointgroup: C01 [X(C18H18Cl1N3O1S1)]
dipole: -1.7077094 -0.2269974 0.1222223 debye
polarizability: 335.4611296|-39.4565288|306.0929862|13.9895122|-8.7925265|154.1465936 unknown
InChI: InChI=1S/C18H18ClN3OS/c1-21(2)10-11-24-18-20-16-12-13(19)8-9-15(16)17(23)22(18)14-6-4-3-5-7-14/h3-9,12H,10-11H2,1-2H3
charge 0 multiplicity 1
42 atoms
Cl 5.323801 -3.048741 0.491892
S  -2.051064 -0.186209 -0.10089
O  1.94082 2.956244 0.160142
N  0.177553 1.40234 0.046808
N  -3.661762 -4.006096 0.011138
N  0.561682 -0.978715 0.106347
C  -0.247401 0.0610 0.031975
C  -3.568593 -2.527793 -0.008236
C  2.480392 0.584463 0.231261
C  -2.095705 -2.08886 -0.098779
C  1.578849 1.748096 0.148225
C  1.939524 -0.741702 0.207772
C  -0.782534 2.498149 -0.041657
C  3.881618 0.780641 0.333712
C  2.819642 -1.857436 0.287755
C  -1.129266 3.015175 -1.308383
C  -1.335036 3.034222 1.141281
C  -4.96147 -4.505368 -0.483473
C  -3.305823 -4.598207 1.31775
C  4.751954 -0.317986 0.41357
C  4.19469 -1.62253 0.38844
C  -2.054267 4.078603 -1.390762
C  -2.259512 4.097593 1.051553
C  -2.62104 4.618646 -0.212714
H  -4.053598 -2.059591 0.886187
H  -4.1116 -2.162949 -0.90003
H  -1.626037 -2.445492 -1.026742
H  -1.488403 -2.417263 0.757313
H  4.262969 1.806572 0.348388
H  2.400852 -2.866088 0.26727
H  -0.676299 2.591378 -2.210406
H  -1.039193 2.625707 2.112879
H  -5.148735 -4.118986 -1.500832
H  -5.827243 -4.216272 0.164769
H  -4.934007 -5.608356 -0.538878
H  -3.303473 -5.699315 1.233714
H  -4.017171 -4.313006 2.134328
H  -2.292654 -4.286115 1.622339
H  5.833463 -0.180684 0.492854
H  -2.328029 4.486103 -2.369688
H  -2.692312 4.519875 1.964633
H  -3.336782 5.445352 -0.279225
