program: Orca
programVersion: 5.0.2
elementType: Si F O O C C C C C C C C C C C C C C C C C C C C C C C C C H H H H H H H H H H H H H H H H H H H H H H H H H H H H H
charge: 0
multiplicity: 1
keywords: wb97x-d3
keywords: def2-TZVPP
keywords: def2/J RIJCOSX
keywords: DEFGRID2
keywords: scfconv7
keywords: smallprint printgap noloewdin
keywords: NOSOSCF
formula: C25H29FO2Si
InChI: InChI=1/C25H29FO2Si/c1-4-27-21-13-15-23(16-14-21)29(2,3)18-8-9-20-12-17-24(26)25(19-20)28-22-10-6-5-7-11-22/h5-7,10-17,19H,4,8-9,18H2,1-3H3
58 atoms
Si -3.446909 1.197221 0.661741
F  1.524929 -1.370681 -3.035385
O  2.296422 2.727697 -0.472179
O  2.130906 -1.607872 -0.477966
C  -3.682928 -0.633438 0.252637
C  -2.96157 -1.590803 1.207809
C  -1.655788 1.650106 0.309758
C  -3.845271 1.520173 2.476198
C  -4.588819 2.225052 -0.433162
C  -2.50695 -2.899409 0.541929
C  -0.922242 2.517494 1.127517
C  -1.005803 1.171575 -0.82713
C  -1.413322 -2.631178 -0.453046
C  0.380173 2.876397 0.836262
C  0.300149 1.521207 -1.143501
C  1.013386 2.370408 -0.300581
C  -0.133877 -2.337278 0.014421
C  -1.662092 -2.555159 -1.816179
C  0.864154 -1.911338 -0.844874
C  -0.664986 -2.149911 -2.695481
C  0.57479 -1.815809 -2.203745
C  3.083676 2.090826 -1.462649
C  2.963818 2.750985 -2.822886
C  2.448135 -1.210552 0.792145
C  1.655313 -0.34979 1.540237
C  3.667992 -1.653601 1.283989
C  2.099928 0.064269 2.786424
C  4.100482 -1.226348 2.529406
C  3.318016 -0.369041 3.288432
H  -4.749005 -0.876337 0.211911
H  -3.319724 -0.772968 -0.770889
H  -3.616162 -1.824441 2.050911
H  -2.076876 -1.114503 1.644415
H  -3.194158 0.954082 3.144028
H  -3.748584 2.574871 2.738769
H  -4.873314 1.230027 2.700253
H  -4.382802 2.054368 -1.490893
H  -5.639022 1.983572 -0.259581
H  -4.460677 3.29245 -0.248681
H  -2.152165 -3.592607 1.309166
H  -3.357582 -3.381349 0.053655
H  -1.372724 2.92264 2.026636
H  -1.516052 0.491926 -1.500984
H  0.933592 3.533946 1.49451
H  0.746846 1.109685 -2.037788
H  0.072533 -2.418894 1.074437
H  -2.644427 -2.797943 -2.200918
H  -0.852772 -2.07658 -3.758517
H  2.851939 1.022481 -1.519202
H  4.110329 2.170518 -1.10314
H  3.240845 3.80358 -2.77073
H  3.635634 2.261462 -3.528783
H  1.954581 2.68889 -3.229092
H  0.708749 0.010719 1.160118
H  4.27314 -2.320705 0.684214
H  1.48397 0.744428 3.359594
H  5.054433 -1.569661 2.907565
H  3.657591 -0.03658 4.260079
totalener: -1510.04694298 hartree
nucrepener: 3074.45190347 hartree
electener: -4584.49884646 hartree
oneelecener: -8178.28398093 hartree
twoeener: 3593.78513447 hartree
kineticenergy: 1503.94608283 hartree
xcener: -135.244014123853 hartree
chargesum: -0.0000000
charge: 0.417833 -0.202598 -0.292423 -0.296436 -0.267637 -0.113654 -0.128150 -0.414095 -0.377820 -0.126019 -0.018847 -0.149344 0.112376 -0.314122 -0.200250 0.342816 -0.230037 -0.259549 0.266773 -0.079888 0.088973 0.052977 -0.251780 0.254608 -0.126568 -0.200834 -0.140662 -0.103784 -0.127068 0.090413 0.068473 0.089056 0.060880 0.102494 0.093806 0.099920 0.092156 0.089333 0.094667 0.091332 0.075928 0.105644 0.108070 0.109448 0.117201 0.131033 0.117794 0.121937 0.059214 0.097919 0.089030 0.084872 0.082564 0.118304 0.124522 0.122165 0.123732 0.123300
qa: 0.4178 -0.2026 -0.2924 -0.2964 -0.2676 -0.1137 -0.1282 -0.4141 -0.3778 -0.1260 -0.0188 -0.1493 0.1124 -0.3141 -0.2003 0.3428 -0.2300 -0.2595 0.2668 -0.0799 0.0890 0.0530 -0.2518 0.2546 -0.1266 -0.2008 -0.1407 -0.1038 -0.1271 0.0904 0.0685 0.0891 0.0609 0.1025 0.0938 0.0999 0.0922 0.0893 0.0947 0.0913 0.0759 0.1056 0.1081 0.1094 0.1172 0.1310 0.1178 0.1219 0.0592 0.0979 0.0890 0.0849 0.0826 0.1183 0.1245 0.1222 0.1237 0.1233
va: 4.1802 1.0858 2.1054 2.0900 3.8371 3.8742 3.7546 3.9072 3.8923 3.9132 3.7828 3.9020 3.5865 4.0625 3.8355 3.7562 3.9507 3.9554 3.6761 3.8742 4.0289 3.8680 3.9321 3.7045 3.8500 4.0372 4.0011 3.9475 3.9618 1.0155 1.0252 1.0089 1.0071 1.0075 1.0133 1.0127 1.0134 1.0125 1.0140 1.0088 1.0103 0.9949 0.9911 1.0228 1.0119 1.0057 1.0100 1.0061 1.0145 0.9952 1.0061 1.0107 1.0050 0.9914 1.0148 1.0056 0.9993 1.0006
dispcorr: -0.037538214 hartree
energy: -1510.084481197538
dipole: -19.24152 18.89551 -0.34601 10.35988 -10.63020 -0.27032 8.76460 -8.47325 0.29136
magnitude: 0.52696 au
magnitude: 1.33943 debye
