program: Orca
programVersion: 5.0.2
elementType: Si F O O C C C C C C C C C C C C C C C C C C C C C C C C C H H H H H H H H H H H H H H H H H H H H H H H H H H H H H
charge: 0
multiplicity: 1
keywords: wb97x-d3
keywords: def2-TZVPP
keywords: def2/J RIJCOSX
keywords: DEFGRID2
keywords: scfconv7
keywords: smallprint printgap noloewdin
keywords: NOSOSCF
formula: C25H29FO2Si
InChI: InChI=1/C25H29FO2Si/c1-4-27-21-13-15-23(16-14-21)29(2,3)18-8-9-20-12-17-24(26)25(19-20)28-22-10-6-5-7-11-22/h5-7,10-17,19H,4,8-9,18H2,1-3H3
58 atoms
Si -3.757436 1.717577 0.932317
F  1.442437 -4.332189 -2.989455
O  1.932447 3.671794 0.438744
O  2.235802 -3.25477 -0.686649
C  -3.568149 -0.139239 1.260578
C  -2.620277 -0.819619 0.274365
C  -2.028962 2.426287 0.751003
C  -4.652165 2.536797 2.374214
C  -4.731467 1.989754 -0.657906
C  -2.44462 -2.319772 0.526982
C  -1.126697 2.376947 1.820461
C  -1.548478 2.934604 -0.450492
C  -1.421496 -2.916512 -0.397381
C  0.179611 2.801903 1.696236
C  -0.237197 3.372774 -0.601692
C  0.637679 3.302246 0.476173
C  -0.069235 -2.824814 -0.081759
C  -1.78612 -3.501852 -1.603476
C  0.906083 -3.283916 -0.954568
C  -0.823284 -3.986006 -2.476995
C  0.51085 -3.869201 -2.152447
C  2.478468 4.160252 -0.769094
C  3.947303 4.42836 -0.540113
C  2.80011 -2.201166 -0.027793
C  3.90062 -2.492177 0.767309
C  2.359015 -0.889985 -0.16352
C  4.560025 -1.468414 1.427984
C  3.02045 0.122644 0.515661
C  4.120537 -0.157922 1.311997
H  -3.198186 -0.283578 2.282114
H  -4.55387 -0.617317 1.234768
H  -1.638995 -0.338637 0.318927
H  -2.970711 -0.676207 -0.752911
H  -4.795788 3.602989 2.194219
H  -5.636493 2.095075 2.53865
H  -4.093685 2.438751 3.306492
H  -5.747156 1.603469 -0.557559
H  -4.813467 3.048896 -0.907231
H  -4.279035 1.484105 -1.512528
H  -2.143177 -2.47528 1.566807
H  -3.405166 -2.82776 0.406732
H  -1.446037 1.987975 2.781724
H  -2.20207 2.993779 -1.3130
H  0.863377 2.748221 2.533787
H  0.079219 3.75852 -1.561242
H  0.228657 -2.379735 0.860516
H  -2.832803 -3.586908 -1.867307
H  -1.10168 -4.449504 -3.414127
H  1.963987 5.078356 -1.07741
H  2.349536 3.426227 -1.573679
H  4.476217 3.516109 -0.264833
H  4.399554 4.815101 -1.452827
H  4.097167 5.165069 0.248316
H  4.234587 -3.517417 0.857199
H  1.508336 -0.65055 -0.788097
H  5.418378 -1.701711 2.044123
H  2.670436 1.141476 0.42057
H  4.62908 0.639051 1.837443
totalener: -1510.05093020 hartree
nucrepener: 2848.64428726 hartree
electener: -4358.69521745 hartree
oneelecener: -7726.42213330 hartree
twoeener: 3367.72691584 hartree
kineticenergy: 1503.94490907 hartree
xcener: -135.232681702353 hartree
chargesum: 0.0000000
charge: 0.436147 -0.193854 -0.294490 -0.290978 -0.259227 -0.115140 -0.161811 -0.388011 -0.408483 -0.088187 -0.055581 -0.096952 0.087285 -0.246569 -0.204742 0.306906 -0.247061 -0.190366 0.205363 -0.140678 0.166197 0.012943 -0.249617 0.313605 -0.243140 -0.249798 -0.054147 -0.035945 -0.220577 0.075865 0.076209 0.079621 0.082179 0.096941 0.092338 0.087957 0.099383 0.100860 0.091032 0.078434 0.075666 0.101445 0.112865 0.114733 0.103461 0.128081 0.110107 0.120316 0.098931 0.088091 0.083735 0.080230 0.087286 0.124712 0.129584 0.123686 0.142076 0.121085
qa: 0.4361 -0.1939 -0.2945 -0.2910 -0.2592 -0.1151 -0.1618 -0.3880 -0.4085 -0.0882 -0.0556 -0.0970 0.0873 -0.2466 -0.2047 0.3069 -0.2471 -0.1904 0.2054 -0.1407 0.1662 0.0129 -0.2496 0.3136 -0.2431 -0.2498 -0.0541 -0.0359 -0.2206 0.0759 0.0762 0.0796 0.0822 0.0969 0.0923 0.0880 0.0994 0.1009 0.0910 0.0784 0.0757 0.1014 0.1129 0.1147 0.1035 0.1281 0.1101 0.1203 0.0989 0.0881 0.0837 0.0802 0.0873 0.1247 0.1296 0.1237 0.1421 0.1211
va: 4.1801 1.1031 2.0959 2.1263 3.8359 3.8246 3.8306 3.9052 3.9114 3.8238 3.8785 3.9636 3.6626 4.0550 3.9466 3.7980 3.9520 3.9618 3.7409 3.9057 4.1007 3.8423 3.9832 3.7714 4.0554 3.9647 3.9008 3.8278 4.0319 1.0169 1.0206 1.0118 1.0084 1.0116 1.0121 1.0154 1.0142 1.0096 1.0111 1.0124 1.0133 0.9990 0.9974 1.0193 1.0204 1.0082 1.0106 1.0074 0.9880 0.9841 1.0053 1.0081 1.0055 1.0149 1.0108 0.9986 0.9798 1.0054
dispcorr: -0.029273986 hartree
energy: -1510.080204183308
dipole: -17.81786 17.34581 -0.47205 28.74716 -27.78841 0.95875 10.46733 -10.35471 0.11262
magnitude: 1.07458 au
magnitude: 2.73136 debye
