program: Orca
programVersion: 5.0.2
elementType: Si F O O C C C C C C C C C C C C C C C C C C C C C C C C C H H H H H H H H H H H H H H H H H H H H H H H H H H H H H
charge: 0
multiplicity: 1
keywords: wb97x-d3
keywords: def2-TZVPP
keywords: def2/J RIJCOSX
keywords: DEFGRID2
keywords: scfconv7
keywords: smallprint printgap noloewdin
keywords: NOSOSCF
formula: C25H29FO2Si
InChI: InChI=1/C25H29FO2Si/c1-4-27-21-13-15-23(16-14-21)29(2,3)18-8-9-20-12-17-24(26)25(19-20)28-22-10-6-5-7-11-22/h5-7,10-17,19H,4,8-9,18H2,1-3H3
58 atoms
Si -3.272265 1.122686 1.184004
F  1.450955 -4.742727 -0.41548
O  2.105423 3.673031 0.133794
O  1.729266 -2.369887 -1.730031
C  -3.330014 -0.553802 0.313466
C  -3.215357 -0.466606 -1.206269
C  -1.616743 1.93552 0.83122
C  -3.495194 0.859995 3.037693
C  -4.655078 2.234952 0.542064
C  -3.129075 -1.832246 -1.893137
C  -1.46861 3.319006 0.866948
C  -0.466542 1.189261 0.547438
C  -1.913122 -2.622268 -1.492281
C  -0.248322 3.94359 0.642065
C  0.75745 1.784481 0.31519
C  0.877608 3.173636 0.365092
C  -0.636921 -2.132374 -1.764525
C  -2.020868 -3.840377 -0.833401
C  0.49424 -2.84322 -1.406823
C  -0.894511 -4.565958 -0.466414
C  0.354558 -4.065009 -0.759727
C  2.296931 5.069647 0.172927
C  3.753893 5.350756 -0.112379
C  2.499218 -1.799046 -0.760252
C  2.080913 -1.611087 0.550048
C  3.761959 -1.376628 -1.16027
C  2.93835 -1.000861 1.456204
C  4.602627 -0.768979 -0.245304
C  4.197842 -0.576462 1.069264
H  -2.530532 -1.186005 0.715489
H  -4.261998 -1.061663 0.586901
H  -2.342187 0.132174 -1.482853
H  -4.078006 0.069375 -1.611652
H  -2.721996 0.204377 3.440779
H  -3.433128 1.803948 3.581327
H  -4.462712 0.410712 3.269054
H  -4.680452 3.194633 1.060892
H  -4.542198 2.445386 -0.522364
H  -5.632759 1.771444 0.685537
H  -4.028242 -2.409868 -1.663198
H  -3.127163 -1.689327 -2.977799
H  -2.325083 3.950568 1.075416
H  -0.519145 0.106656 0.499763
H  -0.19761 5.023048 0.684912
H  1.631824 1.183298 0.099665
H  -0.506717 -1.184254 -2.273413
H  -3.000978 -4.238581 -0.603359
H  -0.984023 -5.516824 0.041776
H  2.019084 5.4692 1.15612
H  1.662155 5.566668 -0.571135
H  3.936039 6.424852 -0.085911
H  4.398726 4.881075 0.629503
H  4.041132 4.984202 -1.09724
H  1.098147 -1.924058 0.876756
H  4.07297 -1.529014 -2.18537
H  2.603613 -0.851007 2.473997
H  5.583115 -0.441123 -0.564489
H  4.856979 -0.098592 1.780588
totalener: -1510.05048355 hartree
nucrepener: 2900.45334015 hartree
electener: -4410.50382369 hartree
oneelecener: -7830.33765105 hartree
twoeener: 3419.83382736 hartree
kineticenergy: 1503.95517145 hartree
xcener: -135.236562078099 hartree
chargesum: -0.0000000
charge: 0.441028 -0.192393 -0.277285 -0.299689 -0.259977 -0.130715 -0.134902 -0.381373 -0.418527 -0.124331 -0.106012 -0.018564 0.021030 -0.246449 -0.235507 0.324063 -0.236324 -0.108213 0.158514 -0.161781 0.237026 0.042411 -0.258053 0.339598 -0.211011 -0.216367 -0.156634 -0.079743 -0.135738 0.079524 0.080268 0.082196 0.086813 0.093522 0.092074 0.089346 0.092164 0.102618 0.099891 0.071052 0.100284 0.097419 0.089129 0.102524 0.107581 0.120562 0.108890 0.123098 0.077386 0.077228 0.077208 0.086241 0.086845 0.116665 0.120759 0.122104 0.121069 0.121459
qa: 0.4410 -0.1924 -0.2773 -0.2997 -0.2600 -0.1307 -0.1349 -0.3814 -0.4185 -0.1243 -0.1060 -0.0186 0.0210 -0.2464 -0.2355 0.3241 -0.2363 -0.1082 0.1585 -0.1618 0.2370 0.0424 -0.2581 0.3396 -0.2110 -0.2164 -0.1566 -0.0797 -0.1357 0.0795 0.0803 0.0822 0.0868 0.0935 0.0921 0.0893 0.0922 0.1026 0.0999 0.0711 0.1003 0.0974 0.0891 0.1025 0.1076 0.1206 0.1089 0.1231 0.0774 0.0772 0.0772 0.0862 0.0868 0.1167 0.1208 0.1221 0.1211 0.1215
va: 4.1892 1.1054 2.1295 2.1225 3.8471 3.8419 3.8275 3.8830 3.8952 3.8682 3.9805 3.7824 3.6537 3.9571 4.0110 3.9042 3.9553 3.9016 3.7728 3.9439 4.0365 3.8534 3.9845 3.7129 3.8699 4.0377 3.9568 3.9460 3.9552 1.0164 1.0179 1.0083 1.0115 1.0127 1.0140 1.0119 1.0154 1.0069 1.0100 1.0119 1.0039 1.0017 0.9853 1.0203 1.0247 1.0180 1.0108 1.0075 0.9847 0.9847 1.0071 1.0059 1.0057 1.0177 1.0164 1.0047 0.9990 1.0010
dispcorr: -0.031069644 hartree
energy: -1510.081553189561
dipole: -17.34581 16.77865 -0.56717 29.95923 -29.06204 0.89718 7.51001 -7.37110 0.13891
magnitude: 1.07047 au
magnitude: 2.72093 debye
