program: Orca
programVersion: 5.0.2
elementType: Si F O O C C C C C C C C C C C C C C C C C C C C C C C C C H H H H H H H H H H H H H H H H H H H H H H H H H H H H H
charge: 0
multiplicity: 1
keywords: wb97x-d3
keywords: def2-TZVPP
keywords: def2/J RIJCOSX
keywords: DEFGRID2
keywords: scfconv7
keywords: smallprint printgap noloewdin
keywords: NOSOSCF
formula: C25H29FO2Si
InChI: InChI=1/C25H29FO2Si/c1-4-27-21-13-15-23(16-14-21)29(2,3)18-8-9-20-12-17-24(26)25(19-20)28-22-10-6-5-7-11-22/h5-7,10-17,19H,4,8-9,18H2,1-3H3
58 atoms
Si -4.116754 1.582984 0.990608
F  1.924483 -4.428343 -0.267339
O  1.533894 3.098342 -0.519302
O  1.955427 -1.952544 0.830816
C  -4.569416 -0.052708 0.138236
C  -3.477749 -1.129863 0.200385
C  -2.358212 2.100494 0.583124
C  -4.252769 1.323357 2.85341
C  -5.319537 2.922179 0.43078
C  -2.498481 -1.036196 -0.972711
C  -2.05207 2.81826 -0.579772
C  -1.283372 1.736045 1.389681
C  -1.320417 -1.953565 -0.812332
C  -0.755178 3.14027 -0.922972
C  0.033636 2.041664 1.063013
C  0.307796 2.748486 -0.10499
C  -0.203039 -1.525178 -0.101731
C  -1.32137 -3.247247 -1.321809
C  0.880818 -2.360754 0.095362
C  -0.236795 -4.093864 -1.138573
C  0.860981 -3.641392 -0.436926
C  2.664309 2.688485 0.22853
C  3.893606 3.263653 -0.432815
C  2.988903 -1.332894 0.199014
C  2.97296 -0.981078 -1.144757
C  4.096484 -1.036499 0.987116
C  4.075005 -0.337139 -1.69152
C  5.186329 -0.394853 0.425343
C  5.184931 -0.041092 -0.917654
H  -5.480953 -0.414857 0.62573
H  -4.853889 0.127642 -0.903999
H  -3.922871 -2.129049 0.201984
H  -2.916522 -1.063199 1.138927
H  -3.923894 2.204621 3.405923
H  -5.284999 1.120171 3.1440
H  -3.654389 0.478241 3.199185
H  -6.350469 2.649357 0.662242
H  -5.113943 3.874664 0.920884
H  -5.269464 3.092015 -0.646154
H  -3.032396 -1.26984 -1.898319
H  -2.14536 -0.007731 -1.073158
H  -2.847719 3.137308 -1.243812
H  -1.456705 1.186228 2.307974
H  -0.543405 3.696987 -1.826886
H  0.825998 1.720877 1.726121
H  -0.16956 -0.519855 0.301888
H  -2.179712 -3.604079 -1.877477
H  -0.23692 -5.097626 -1.542242
H  2.726613 1.594866 0.259903
H  2.589952 3.048086 1.261788
H  4.781252 2.950523 0.115473
H  3.9932 2.904627 -1.456198
H  3.865315 4.352958 -0.446131
H  2.116046 -1.197811 -1.768266
H  4.09701 -1.32135 2.031121
H  4.056334 -0.067083 -2.739313
H  6.047322 -0.175777 1.04342
H  6.039327 0.458146 -1.353857
totalener: -1510.04993472 hartree
nucrepener: 2941.63596484 hartree
electener: -4451.68589956 hartree
oneelecener: -7912.42191231 hartree
twoeener: 3460.73601274 hartree
kineticenergy: 1503.95312972 hartree
xcener: -135.238090608083 hartree
chargesum: 0.0000000
charge: 0.439078 -0.194371 -0.282663 -0.295474 -0.259469 -0.120302 -0.152595 -0.393479 -0.421318 -0.100554 -0.055988 -0.130209 -0.031882 -0.240944 -0.249230 0.339551 -0.088066 -0.109396 0.055935 -0.187067 0.267603 0.087285 -0.277554 0.262362 -0.118952 -0.188464 -0.167079 -0.110848 -0.149344 0.086523 0.073806 0.087623 0.074217 0.107010 0.097040 0.086471 0.093657 0.102597 0.086083 0.081965 0.093300 0.103352 0.121003 0.113468 0.118643 0.097026 0.113577 0.120993 0.034486 0.091974 0.080636 0.085332 0.099031 0.123574 0.122530 0.126132 0.124249 0.127138
qa: 0.4391 -0.1944 -0.2827 -0.2955 -0.2595 -0.1203 -0.1526 -0.3935 -0.4213 -0.1006 -0.0560 -0.1302 -0.0319 -0.2409 -0.2492 0.3396 -0.0881 -0.1094 0.0559 -0.1871 0.2676 0.0873 -0.2776 0.2624 -0.1190 -0.1885 -0.1671 -0.1108 -0.1493 0.0865 0.0738 0.0876 0.0742 0.1070 0.0970 0.0865 0.0937 0.1026 0.0861 0.0820 0.0933 0.1034 0.1210 0.1135 0.1186 0.0970 0.1136 0.1210 0.0345 0.0920 0.0806 0.0853 0.0990 0.1236 0.1225 0.1261 0.1242 0.1271
va: 4.1782 1.1045 2.1323 2.1158 3.8122 3.8714 3.7696 3.8937 3.9164 3.7893 3.8671 3.8786 3.7658 4.0793 3.8861 3.8225 3.8477 3.9070 3.8696 3.9474 4.0406 3.8044 3.9838 3.7676 3.8330 3.9694 3.9411 3.9255 3.8823 1.0122 1.0135 1.0109 1.0071 1.0083 1.0144 1.0152 1.0133 1.0111 1.0163 1.0136 1.0172 0.9996 0.9957 1.0193 1.0184 1.0328 1.0084 1.0084 0.9968 0.9934 1.0075 1.0065 1.0101 1.0144 1.0155 1.0021 0.9997 1.0004
dispcorr: -0.033624539 hartree
energy: -1510.083559255311
dipole: -18.63827 18.38981 -0.24846 23.13009 -22.79806 0.33202 3.06463 -3.24492 -0.18029
magnitude: 0.45219 au
magnitude: 1.14938 debye
