program: Orca
programVersion: 5.0.2
elementType: Si F O O C C C C C C C C C C C C C C C C C C C C C C C C C H H H H H H H H H H H H H H H H H H H H H H H H H H H H H
charge: 0
multiplicity: 1
keywords: wb97x-d3
keywords: def2-TZVPP
keywords: def2/J RIJCOSX
keywords: DEFGRID2
keywords: scfconv7
keywords: smallprint printgap noloewdin
keywords: NOSOSCF
formula: C25H29FO2Si
InChI: InChI=1/C25H29FO2Si/c1-4-27-21-13-15-23(16-14-21)29(2,3)18-8-9-20-12-17-24(26)25(19-20)28-22-10-6-5-7-11-22/h5-7,10-17,19H,4,8-9,18H2,1-3H3
58 atoms
Si -3.488524 1.328202 0.036723
F  1.664878 -2.880634 1.944602
O  2.131453 2.547611 1.895493
O  2.188464 -1.876859 -0.455626
C  -3.681153 -0.496627 -0.409259
C  -2.976926 -0.894225 -1.709566
C  -1.702118 1.62804 0.541246
C  -4.620112 1.737989 1.489194
C  -3.924831 2.417744 -1.439811
C  -2.532929 -2.363707 -1.742062
C  -1.011957 0.730865 1.3563
C  -1.027731 2.805334 0.199523
C  -1.410905 -2.603949 -0.771669
C  0.269762 0.984374 1.828807
C  0.247011 3.079707 0.655069
C  0.909302 2.174593 1.486356
C  -0.129762 -2.166879 -1.099508
C  -1.623726 -3.168121 0.478983
C  0.912854 -2.248618 -0.192144
C  -0.585073 -3.27132 1.395961
C  0.664521 -2.802555 1.060724
C  2.916281 1.692971 2.704598
C  3.589774 0.576478 1.929506
C  2.473871 -0.836521 -1.296821
C  1.707249 0.32022 -1.35919
C  3.636201 -0.95523 -2.045947
C  2.118207 1.358359 -2.181074
C  4.034921 0.09267 -2.860632
C  3.277923 1.253081 -2.93507
H  -3.274815 -1.068143 0.432279
H  -4.739704 -0.769555 -0.456605
H  -2.090305 -0.272865 -1.877693
H  -3.640092 -0.698158 -2.55561
H  -4.502971 2.776516 1.801731
H  -5.671694 1.584299 1.240459
H  -4.392487 1.114552 2.355347
H  -3.86233 3.480154 -1.19875
H  -3.267203 2.23514 -2.291037
H  -4.947321 2.227263 -1.770632
H  -3.38209 -3.012314 -1.512196
H  -2.207394 -2.622072 -2.753168
H  -1.468792 -0.211541 1.638809
H  -1.508211 3.539112 -0.437732
H  0.750707 0.240873 2.450013
H  0.745991 4.000652 0.381137
H  0.052173 -1.742054 -2.07954
H  -2.608079 -3.528778 0.748889
H  -0.743761 -3.708844 2.372739
H  2.326249 1.294506 3.537714
H  3.672218 2.346624 3.140979
H  4.135155 0.971116 1.072697
H  4.303184 0.065411 2.577269
H  2.890003 -0.172138 1.565007
H  0.80762 0.427053 -0.767534
H  4.223284 -1.861917 -1.978987
H  1.522668 2.261164 -2.214266
H  4.94347 -0.002411 -3.441005
H  3.592196 2.069593 -3.570991
totalener: -1510.04768416 hartree
nucrepener: 3059.62860240 hartree
electener: -4569.67628657 hartree
oneelecener: -8148.62265971 hartree
twoeener: 3578.94637314 hartree
kineticenergy: 1503.94078339 hartree
xcener: -135.240859806688 hartree
chargesum: 0.0000000
charge: 0.420470 -0.201062 -0.284440 -0.295363 -0.263402 -0.119345 -0.117662 -0.376780 -0.416069 -0.123383 -0.142901 -0.020402 0.114089 -0.206665 -0.321064 0.345143 -0.219402 -0.258221 0.234841 -0.092417 0.119957 0.016791 -0.220919 0.214353 -0.088913 -0.195641 -0.142745 -0.110232 -0.125153 0.066056 0.089879 0.066075 0.088110 0.095192 0.089777 0.091807 0.094045 0.103892 0.100759 0.076546 0.091568 0.106340 0.108665 0.110789 0.112627 0.129155 0.119441 0.122305 0.073030 0.098550 0.088285 0.088933 0.056744 0.111051 0.125673 0.123448 0.123754 0.124042
qa: 0.4205 -0.2011 -0.2844 -0.2954 -0.2634 -0.1193 -0.1177 -0.3768 -0.4161 -0.1234 -0.1429 -0.0204 0.1141 -0.2067 -0.3211 0.3451 -0.2194 -0.2582 0.2348 -0.0924 0.1200 0.0168 -0.2209 0.2144 -0.0889 -0.1956 -0.1427 -0.1102 -0.1252 0.0661 0.0899 0.0661 0.0881 0.0952 0.0898 0.0918 0.0940 0.1039 0.1008 0.0765 0.0916 0.1063 0.1087 0.1108 0.1126 0.1292 0.1194 0.1223 0.0730 0.0986 0.0883 0.0889 0.0567 0.1111 0.1257 0.1234 0.1238 0.1240
va: 4.1806 1.0888 2.1146 2.0916 3.8356 3.8755 3.7504 3.8940 3.9075 3.9063 3.9054 3.7892 3.5858 3.8348 4.0437 3.7594 3.9384 3.9513 3.7069 3.8828 4.0393 3.9089 3.9053 3.7597 3.8214 4.0222 3.9898 3.9543 3.9583 1.0250 1.0158 1.0057 1.0086 1.0140 1.0126 1.0133 1.0134 1.0071 1.0125 1.0101 1.0084 0.9908 0.9948 1.0143 1.0223 1.0072 1.0093 1.0063 0.9948 0.9918 1.0044 1.0163 1.0161 0.9939 1.0145 1.0070 0.9993 1.0007
dispcorr: -0.037496070 hartree
energy: -1510.085180232976
dipole: -18.65929 18.26799 -0.39130 13.34586 -13.36014 -0.01428 -5.04457 4.76246 -0.28211
magnitude: 0.48260 au
magnitude: 1.22668 debye
