program: Orca
programVersion: 5.0.2
elementType: Si F O O C C C C C C C C C C C C C C C C C C C C C C C C C H H H H H H H H H H H H H H H H H H H H H H H H H H H H H
charge: 0
multiplicity: 1
keywords: wb97x-d3
keywords: def2-TZVPP
keywords: def2/J RIJCOSX
keywords: DEFGRID2
keywords: scfconv7
keywords: smallprint printgap noloewdin
keywords: NOSOSCF
formula: C25H29FO2Si
InChI: InChI=1/C25H29FO2Si/c1-4-27-21-13-15-23(16-14-21)29(2,3)18-8-9-20-12-17-24(26)25(19-20)28-22-10-6-5-7-11-22/h5-7,10-17,19H,4,8-9,18H2,1-3H3
58 atoms
Si -3.74698 1.360784 0.232922
F  1.999627 -2.719306 1.467161
O  2.05906 2.372724 1.58742
O  1.975999 -2.420179 -1.223981
C  -3.966242 -0.500166 -0.028946
C  -3.34308 -1.029862 -1.324377
C  -1.941669 1.66513 0.658718
C  -4.859331 1.919323 1.649699
C  -4.200435 2.311325 -1.331524
C  -2.913269 -2.50475 -1.249703
C  -1.204051 0.725228 1.375615
C  -1.274667 2.843234 0.30509
C  -1.613193 -2.661708 -0.511035
C  0.126523 0.921292 1.717975
C  0.04796 3.065176 0.638032
C  0.768165 2.098144 1.342165
C  -0.41411 -2.473512 -1.195098
C  -1.555908 -2.919649 0.854038
C  0.8033 -2.512272 -0.540293
C  -0.342657 -2.942858 1.531016
C  0.824211 -2.720373 0.832365
C  2.882958 1.361611 2.13866
C  4.308372 1.859466 2.117965
C  2.576017 -1.2043 -1.386155
C  1.919927 0.005977 -1.211195
C  3.907829 -1.23506 -1.782985
C  2.61195 1.188246 -1.442717
C  4.582227 -0.048098 -2.007255
C  3.938925 1.171198 -1.838893
H  -3.523703 -0.999084 0.839658
H  -5.027499 -0.764449 0.005948
H  -2.466967 -0.437852 -1.609483
H  -4.060693 -0.906579 -2.138955
H  -5.913833 1.748785 1.425257
H  -4.628166 1.383452 2.571568
H  -4.735102 2.983225 1.856597
H  -3.563458 2.038035 -2.173714
H  -5.233702 2.115484 -1.623186
H  -4.11006 3.389888 -1.191488
H  -3.701129 -3.094302 -0.774038
H  -2.799921 -2.900939 -2.261828
H  -1.658481 -0.21061 1.676689
H  -1.794194 3.613557 -0.253734
H  0.646672 0.144447 2.261534
H  0.544199 3.983564 0.349839
H  -0.418634 -2.300687 -2.265145
H  -2.469245 -3.106298 1.405142
H  -0.301576 -3.136118 2.594986
H  2.798714 0.439159 1.553365
H  2.569343 1.134533 3.16507
H  4.417555 2.782271 2.687284
H  4.965147 1.110738 2.560045
H  4.642268 2.036389 1.096254
H  0.883645 0.045631 -0.90095
H  4.4030 -2.1888 -1.909334
H  2.095057 2.129068 -1.312079
H  5.619934 -0.077852 -2.312645
H  4.467075 2.098031 -2.017501
totalener: -1510.04845452 hartree
nucrepener: 3031.98814580 hartree
electener: -4542.03660032 hartree
oneelecener: -8093.20574080 hartree
twoeener: 3551.16914048 hartree
kineticenergy: 1503.94945033 hartree
xcener: -135.238569826898 hartree
chargesum: -0.0000000
charge: 0.416737 -0.199557 -0.284377 -0.301430 -0.273056 -0.128420 -0.137687 -0.377242 -0.410101 -0.119323 -0.077859 -0.027011 0.173133 -0.250474 -0.267522 0.287146 -0.245946 -0.271153 0.221492 -0.129456 0.165158 0.023657 -0.255024 0.289081 -0.183414 -0.205959 -0.107858 -0.068735 -0.206109 0.063982 0.092105 0.076715 0.088025 0.089067 0.091875 0.093723 0.104273 0.099559 0.093818 0.083478 0.090113 0.114183 0.103058 0.108175 0.119295 0.117638 0.127707 0.126441 0.088383 0.100965 0.088232 0.079869 0.083198 0.121818 0.121136 0.132890 0.123297 0.128290
qa: 0.4167 -0.1996 -0.2844 -0.3014 -0.2731 -0.1284 -0.1377 -0.3772 -0.4101 -0.1193 -0.0779 -0.0270 0.1731 -0.2505 -0.2675 0.2871 -0.2459 -0.2712 0.2215 -0.1295 0.1652 0.0237 -0.2550 0.2891 -0.1834 -0.2060 -0.1079 -0.0687 -0.2061 0.0640 0.0921 0.0767 0.0880 0.0891 0.0919 0.0937 0.1043 0.0996 0.0938 0.0835 0.0901 0.1142 0.1031 0.1082 0.1193 0.1176 0.1277 0.1264 0.0884 0.1010 0.0882 0.0799 0.0832 0.1218 0.1211 0.1329 0.1233 0.1283
va: 4.1824 1.0911 2.0977 2.1153 3.8255 3.8903 3.8041 3.8914 3.9015 3.8681 3.8594 3.8470 3.4805 3.9008 4.0364 3.8052 4.0377 3.9323 3.7441 3.8693 4.0635 3.8282 3.9699 3.7631 3.8392 4.0328 3.8650 3.9192 3.9593 1.0237 1.0155 1.0003 1.0062 1.0128 1.0133 1.0145 1.0078 1.0121 1.0144 1.0086 1.0088 0.9848 0.9957 1.0174 1.0178 1.0171 1.0028 1.0053 0.9851 0.9914 1.0067 1.0081 1.0114 1.0090 1.0165 1.0048 0.9974 1.0006
dispcorr: -0.036720013 hartree
energy: -1510.085174532912
dipole: -18.72564 18.19092 -0.53472 16.00228 -16.09339 -0.09112 -0.53379 0.57319 0.03940
magnitude: 0.54385 au
magnitude: 1.38237 debye
