program: Orca
programVersion: 5.0.2
elementType: Si F O O C C C C C C C C C C C C C C C C C C C C C C C C C H H H H H H H H H H H H H H H H H H H H H H H H H H H H H
charge: 0
multiplicity: 1
keywords: wb97x-d3
keywords: def2-TZVPP
keywords: def2/J RIJCOSX
keywords: DEFGRID2
keywords: scfconv7
keywords: smallprint printgap noloewdin
keywords: NOSOSCF
formula: C25H29FO2Si
InChI: InChI=1/C25H29FO2Si/c1-4-27-21-13-15-23(16-14-21)29(2,3)18-8-9-20-12-17-24(26)25(19-20)28-22-10-6-5-7-11-22/h5-7,10-17,19H,4,8-9,18H2,1-3H3
58 atoms
Si -2.760028 1.578634 -0.863926
F  1.870665 -4.368389 -0.358655
O  1.704831 2.54013 3.091452
O  2.052102 -1.672132 -0.220387
C  -2.953937 -0.284079 -1.18555
C  -3.566629 -1.143789 -0.077279
C  -1.368183 1.964874 0.334247
C  -4.377598 2.252099 -0.165139
C  -2.371107 2.389683 -2.521361
C  -2.660899 -1.394773 1.135662
C  -0.040554 1.989279 -0.088847
C  -1.595291 2.175568 1.698281
C  -1.438049 -2.196427 0.786786
C  1.01559 2.1754 0.792564
C  -0.560461 2.363141 2.593919
C  0.761842 2.353047 2.149673
C  -0.235754 -1.564577 0.496428
C  -1.492719 -3.584958 0.694826
C  0.874844 -2.28906 0.091175
C  -0.379959 -4.323748 0.325632
C  0.796922 -3.670013 0.015631
C  3.062996 2.296573 2.78433
C  3.387011 0.817723 2.680188
C  2.070218 -0.805218 -1.270421
C  1.124486 -0.816045 -2.288925
C  3.11385 0.112235 -1.298599
C  1.219545 0.111409 -3.316866
C  3.195692 1.030503 -2.331612
C  2.244319 1.044238 -3.342533
H  -3.590465 -0.364381 -2.074282
H  -1.987724 -0.697464 -1.494069
H  -3.855567 -2.115101 -0.491506
H  -4.496262 -0.68676 0.274578
H  -4.315673 3.326298 0.014465
H  -5.204888 2.082315 -0.856402
H  -4.650841 1.779322 0.779892
H  -3.166192 2.21318 -3.247778
H  -2.249943 3.468649 -2.418232
H  -1.44742 1.998936 -2.952954
H  -2.3607 -0.44631 1.585371
H  -3.238785 -1.926381 1.896062
H  0.205183 1.840669 -1.134639
H  -2.608939 2.187208 2.083258
H  2.021219 2.167775 0.396479
H  -0.760834 2.516074 3.646634
H  -0.157902 -0.486669 0.573564
H  -2.41633 -4.102551 0.923645
H  -0.421138 -5.403189 0.26677
H  3.62004 2.741995 3.608943
H  3.366139 2.832013 1.877862
H  3.133286 0.301112 3.605323
H  2.854595 0.324914 1.866824
H  4.455699 0.685149 2.506431
H  0.318919 -1.538044 -2.291077
H  3.854532 0.097963 -0.509277
H  0.480078 0.096395 -4.107107
H  4.010085 1.743109 -2.343907
H  2.308485 1.76594 -4.145171
totalener: -1510.04654562 hartree
nucrepener: 3055.76645554 hartree
electener: -4565.81300116 hartree
oneelecener: -8140.62723970 hartree
twoeener: 3574.81423854 hartree
kineticenergy: 1503.95721031 hartree
xcener: -135.245198882976 hartree
chargesum: -0.0000000
charge: 0.407720 -0.192879 -0.293367 -0.308504 -0.232317 -0.144053 -0.146949 -0.410951 -0.396615 -0.127143 -0.082346 -0.064709 -0.001142 -0.230769 -0.226844 0.323412 -0.124892 -0.121724 0.143350 -0.187094 0.231128 0.030254 -0.236132 0.292130 -0.133448 -0.266381 -0.192578 -0.085622 -0.118471 0.092740 0.055438 0.087435 0.078639 0.110141 0.101107 0.082696 0.092995 0.101629 0.082207 0.084954 0.091321 0.097589 0.119849 0.106117 0.113144 0.106912 0.114686 0.120306 0.100334 0.069585 0.095562 0.059040 0.082590 0.130811 0.137891 0.129679 0.126165 0.125373
qa: 0.4077 -0.1929 -0.2934 -0.3085 -0.2323 -0.1441 -0.1469 -0.4110 -0.3966 -0.1271 -0.0823 -0.0647 -0.0011 -0.2308 -0.2268 0.3234 -0.1249 -0.1217 0.1433 -0.1871 0.2311 0.0303 -0.2361 0.2921 -0.1334 -0.2664 -0.1926 -0.0856 -0.1185 0.0927 0.0554 0.0874 0.0786 0.1101 0.1011 0.0827 0.0930 0.1016 0.0822 0.0850 0.0913 0.0976 0.1198 0.1061 0.1131 0.1069 0.1147 0.1203 0.1003 0.0696 0.0956 0.0590 0.0826 0.1308 0.1379 0.1297 0.1262 0.1254
va: 4.2046 1.1060 2.1203 2.0979 3.8065 3.9020 3.6875 3.9225 3.9036 3.8426 3.8828 3.8123 3.7375 3.8678 4.0974 3.8182 3.8419 3.9014 3.6598 3.9536 4.1032 3.8951 3.9153 3.7545 3.8482 3.9447 3.9402 3.9269 3.9171 1.0104 1.0351 1.0026 1.0040 1.0106 1.0103 1.0110 1.0134 1.0128 1.0173 1.0249 1.0103 0.9847 0.9905 1.0217 1.0186 1.0047 1.0066 1.0081 0.9933 0.9954 1.0119 1.0124 1.0122 1.0058 1.0060 1.0019 0.9987 1.0001
dispcorr: -0.037749170 hartree
energy: -1510.084294793584
dipole: -16.78884 16.46089 -0.32795 19.11336 -18.83209 0.28127 -1.40814 1.25454 -0.15360
magnitude: 0.45854 au
magnitude: 1.16551 debye
