program: Orca
programVersion: 5.0.2
elementType: Si F O O C C C C C C C C C C C C C C C C C C C C C C C C C H H H H H H H H H H H H H H H H H H H H H H H H H H H H H
charge: 0
multiplicity: 1
keywords: wb97x-d3
keywords: def2-TZVPP
keywords: def2/J RIJCOSX
keywords: DEFGRID2
keywords: scfconv7
keywords: smallprint printgap noloewdin
keywords: NOSOSCF
formula: C25H29FO2Si
InChI: InChI=1/C25H29FO2Si/c1-4-27-21-13-15-23(16-14-21)29(2,3)18-8-9-20-12-17-24(26)25(19-20)28-22-10-6-5-7-11-22/h5-7,10-17,19H,4,8-9,18H2,1-3H3
58 atoms
Si -4.04233 1.537232 0.755494
F  2.064933 -4.074648 -0.8948
O  1.963019 2.025567 1.29482
O  1.910191 -1.697427 0.423921
C  -4.513717 -0.298726 0.988896
C  -3.375015 -1.299756 0.792979
C  -2.179379 1.750787 0.89433
C  -4.895272 2.542462 2.102968
C  -4.613753 2.153789 -0.932942
C  -2.834658 -1.339829 -0.637316
C  -1.504532 1.494521 2.094257
C  -1.390343 2.11953 -0.192024
C  -1.536791 -2.089718 -0.73748
C  -0.131902 1.595743 2.201104
C  -0.007156 2.229815 -0.110886
C  0.638101 1.967655 1.095142
C  -0.392967 -1.546339 -0.154477
C  -1.434296 -3.317355 -1.376735
C  0.814246 -2.214672 -0.200086
C  -0.223774 -3.997907 -1.436091
C  0.890087 -3.442908 -0.846157
C  2.823941 2.466187 0.260289
C  2.823774 3.974516 0.09877
C  2.893436 -1.130424 -0.324681
C  2.744171 -0.794863 -1.664373
C  4.08948 -0.868298 0.334069
C  3.805599 -0.205586 -2.339287
C  5.136055 -0.279441 -0.352641
C  5.003573 0.05544 -1.694421
H  -4.922828 -0.417405 1.996997
H  -5.342015 -0.53608 0.31183
H  -3.700264 -2.306448 1.071753
H  -2.556115 -1.055408 1.473955
H  -4.696438 3.609107 1.992597
H  -5.977674 2.403291 2.078185
H  -4.555167 2.249746 3.097906
H  -4.188666 1.575938 -1.75564
H  -5.699185 2.077746 -1.018637
H  -4.350086 3.20064 -1.092502
H  -3.582035 -1.782481 -1.301186
H  -2.673626 -0.319909 -0.99823
H  -2.062279 1.20202 2.977819
H  -1.853841 2.329176 -1.149428
H  0.366685 1.385789 3.138661
H  0.544843 2.516368 -0.995441
H  -0.435344 -0.587252 0.348346
H  -2.309283 -3.757181 -1.838846
H  -0.144796 -4.955428 -1.933308
H  2.59492 1.960293 -0.682924
H  3.814245 2.122831 0.554732
H  3.547691 4.259281 -0.665646
H  1.852025 4.365878 -0.201764
H  3.109323 4.46482 1.029202
H  1.814904 -0.984884 -2.185337
H  4.187914 -1.131012 1.378934
H  3.686149 0.048184 -3.384658
H  6.065937 -0.084302 0.165761
H  5.826277 0.509397 -2.229883
totalener: -1510.04717132 hartree
nucrepener: 2990.18723409 hartree
electener: -4500.23440541 hartree
oneelecener: -8009.76671492 hartree
twoeener: 3509.53230951 hartree
kineticenergy: 1503.95592579 hartree
xcener: -135.242144679817 hartree
chargesum: -0.0000000
charge: 0.438864 -0.195507 -0.290292 -0.288292 -0.279722 -0.109718 -0.078445 -0.412180 -0.403706 -0.109557 -0.128576 -0.170615 0.011928 -0.205669 -0.177961 0.303734 -0.082545 -0.099144 0.033487 -0.181225 0.278803 0.020172 -0.253275 0.280156 -0.149991 -0.164113 -0.157228 -0.158125 -0.120476 0.096129 0.078493 0.088213 0.080930 0.095906 0.092880 0.088173 0.091069 0.100007 0.102154 0.082966 0.074902 0.108656 0.117700 0.111624 0.105667 0.053771 0.107915 0.119774 0.064390 0.113502 0.084030 0.085956 0.091284 0.121160 0.118259 0.124305 0.125935 0.123470
qa: 0.4389 -0.1955 -0.2903 -0.2883 -0.2797 -0.1097 -0.0784 -0.4122 -0.4037 -0.1096 -0.1286 -0.1706 0.0119 -0.2057 -0.1780 0.3037 -0.0825 -0.0991 0.0335 -0.1812 0.2788 0.0202 -0.2533 0.2802 -0.1500 -0.1641 -0.1572 -0.1581 -0.1205 0.0961 0.0785 0.0882 0.0809 0.0959 0.0929 0.0882 0.0911 0.1000 0.1022 0.0830 0.0749 0.1087 0.1177 0.1116 0.1057 0.0538 0.1079 0.1198 0.0644 0.1135 0.0840 0.0860 0.0913 0.1212 0.1183 0.1243 0.1259 0.1235
va: 4.1179 1.1017 2.0918 2.1077 3.8464 3.8527 3.7166 3.9055 3.8964 3.7775 3.9126 3.9370 3.7056 4.0513 3.8840 3.7887 3.8506 3.8992 3.9032 3.9639 4.0200 3.8850 3.9664 3.7198 3.8435 3.9506 3.9573 3.9353 3.8918 1.0084 1.0127 1.0119 1.0117 1.0143 1.0120 1.0158 1.0135 1.0153 1.0099 1.0161 1.0273 0.9978 0.9968 1.0208 1.0138 1.0364 1.0111 1.0090 0.9914 0.9933 1.0097 1.0049 1.0061 1.0157 1.0180 1.0013 0.9997 1.0000
dispcorr: -0.035034944 hartree
energy: -1510.082206263996
dipole: -21.76142 21.39764 -0.36377 25.45369 -24.88851 0.56518 0.58261 -1.16122 -0.57861
magnitude: 0.88688 au
magnitude: 2.25426 debye
