program: Orca
programVersion: 5.0.2
elementType: Si F O O C C C C C C C C C C C C C C C C C C C C C C C C C H H H H H H H H H H H H H H H H H H H H H H H H H H H H H
charge: 0
multiplicity: 1
keywords: wb97x-d3
keywords: def2-TZVPP
keywords: def2/J RIJCOSX
keywords: DEFGRID2
keywords: scfconv7
keywords: smallprint printgap noloewdin
keywords: NOSOSCF
formula: C25H29FO2Si
InChI: InChI=1/C25H29FO2Si/c1-4-27-21-13-15-23(16-14-21)29(2,3)18-8-9-20-12-17-24(26)25(19-20)28-22-10-6-5-7-11-22/h5-7,10-17,19H,4,8-9,18H2,1-3H3
58 atoms
Si -4.072645 1.547338 0.784047
F  2.055771 -4.086976 -0.934667
O  1.93561 2.052193 1.245777
O  1.923958 -1.730742 0.42516
C  -4.506376 -0.30137 0.986851
C  -3.350936 -1.279962 0.774874
C  -2.212203 1.786494 0.905331
C  -4.929306 2.512098 2.158816
C  -4.674936 2.179261 -0.887581
C  -2.81042 -1.29361 -0.655968
C  -1.520737 1.525943 2.094643
C  -1.439603 2.167393 -0.188484
C  -1.518862 -2.053234 -0.768853
C  -0.146814 1.627746 2.182962
C  -0.055756 2.279103 -0.12584
C  0.607288 2.004018 1.067593
C  -0.36984 -1.532845 -0.174824
C  -1.429477 -3.273051 -1.425262
C  0.828234 -2.218089 -0.222513
C  -0.227628 -3.968174 -1.49045
C  0.890597 -3.437467 -0.886694
C  2.784328 2.463816 0.189609
C  2.819423 3.970756 0.019529
C  2.933388 -1.172356 -0.293822
C  2.826033 -0.830915 -1.635628
C  4.113141 -0.925989 0.399817
C  3.912101 -0.250451 -2.277811
C  5.184636 -0.345352 -0.254407
C  5.093592 -0.003999 -1.598047
H  -4.910979 -0.445027 1.993534
H  -5.331516 -0.544258 0.307818
H  -3.659752 -2.295508 1.039942
H  -2.535138 -1.031825 1.458284
H  -4.75149 3.584067 2.066233
H  -6.00917 2.353297 2.141907
H  -4.574506 2.207786 3.145138
H  -4.247248 1.622388 -1.723312
H  -5.759442 2.082393 -0.963125
H  -4.434054 3.233362 -1.033675
H  -3.560476 -1.718076 -1.328773
H  -2.641496 -0.267812 -0.995732
H  -2.065937 1.227156 2.983905
H  -1.917022 2.385849 -1.137064
H  0.365042 1.411477 3.111874
H  0.482618 2.575499 -1.015463
H  -0.402208 -0.580901 0.342618
H  -2.30853 -3.696227 -1.895094
H  -0.15945 -4.919859 -2.000387
H  2.519361 1.959945 -0.745156
H  3.771873 2.094799 0.4626
H  1.851215 4.384678 -0.261558
H  3.137119 4.458691 0.940636
H  3.53296 4.234046 -0.762098
H  1.909717 -1.008841 -2.183031
H  4.179043 -1.194777 1.44569
H  3.825701 0.007846 -3.325249
H  6.101578 -0.163012 0.290917
H  5.936299 0.442612 -2.107885
totalener: -1510.04732818 hartree
nucrepener: 2983.20152707 hartree
electener: -4493.24885524 hartree
oneelecener: -7995.78295817 hartree
twoeener: 3502.53410293 hartree
kineticenergy: 1503.95412673 hartree
xcener: -135.241226231196 hartree
chargesum: 0.0000000
charge: 0.440524 -0.195430 -0.289431 -0.288200 -0.280064 -0.110383 -0.076194 -0.412224 -0.403829 -0.109201 -0.129948 -0.176332 0.013860 -0.203961 -0.176927 0.304011 -0.084866 -0.100055 0.034198 -0.180023 0.274088 0.015665 -0.252554 0.283889 -0.150078 -0.167617 -0.158875 -0.153545 -0.122231 0.096154 0.078528 0.088438 0.080868 0.096051 0.093016 0.088043 0.090714 0.100016 0.102475 0.082731 0.076172 0.108829 0.118241 0.111875 0.104407 0.056673 0.107872 0.119864 0.067393 0.114757 0.085642 0.091116 0.084131 0.121187 0.117930 0.124763 0.124663 0.123182
qa: 0.4405 -0.1954 -0.2894 -0.2882 -0.2801 -0.1104 -0.0762 -0.4122 -0.4038 -0.1092 -0.1299 -0.1763 0.0139 -0.2040 -0.1769 0.3040 -0.0849 -0.1001 0.0342 -0.1800 0.2741 0.0157 -0.2526 0.2839 -0.1501 -0.1676 -0.1589 -0.1535 -0.1222 0.0962 0.0785 0.0884 0.0809 0.0961 0.0930 0.0880 0.0907 0.1000 0.1025 0.0827 0.0762 0.1088 0.1182 0.1119 0.1044 0.0567 0.1079 0.1199 0.0674 0.1148 0.0856 0.0911 0.0841 0.1212 0.1179 0.1248 0.1247 0.1232
va: 4.1188 1.1016 2.0938 2.1096 3.8441 3.8542 3.7148 3.9047 3.8969 3.7759 3.9161 3.9445 3.7016 4.0463 3.8872 3.7950 3.8538 3.9008 3.9022 3.9623 4.0202 3.8849 3.9648 3.7279 3.8435 3.9587 3.9596 3.9401 3.8927 1.0084 1.0125 1.0121 1.0116 1.0142 1.0118 1.0157 1.0134 1.0152 1.0099 1.0161 1.0272 0.9977 0.9967 1.0207 1.0149 1.0402 1.0111 1.0090 0.9917 0.9926 1.0049 1.0060 1.0097 1.0157 1.0179 1.0013 1.0002 1.0002
dispcorr: -0.034765910 hartree
energy: -1510.082094087744
dipole: -21.81841 21.45513 -0.36329 25.41934 -24.85638 0.56296 0.70121 -1.28268 -0.58148
magnitude: 0.88714 au
magnitude: 2.25493 debye
